{"text_format":"1","workbook":"xlsx","n_sheets":34,"sheets":["Introduction","Admin","Admin Data","Finance","Finance Data","CustServ","CustServ Data","Police","Police Data","Fire","Fire Data","Parks","Parks Data","Public","Public Data","Planning","Planning Data","Garage","Garage Data","Electric","Electric Data","Gas","Gas Data","Water","Water Data","Solid","Solid Data","Storm","Storm Data","Fiber","Fiber Data","Controls","Measure Descriptions","Paper Intro"],"not_rendered":{"charts":349,"images":46,"macros":1,"external_links":0,"defined_names":16,"comments":0,"pivot_tables":0},"unopened":[],"bounds":{"document_bytes":16777216,"sheet_cells":100000,"rows_first":2000,"rows_last":500,"rows_between":2000,"halvings":0,"cell_chars":16384,"cell_head_chars":4096},"cells_cut":0,"cells_raw":0,"read":"whole","date_system":"1900"}

{"sheet":"Introduction","index":0,"n_rows":21,"n_cols":3,"rows_kept":21,"cut":false,"hidden":false,"merged":[[22,0,22,13],[11,3,11,8],[13,3,13,8]]}
[]
[]
[]
[]
[]
[]
[]
[]
[null,null,"Performance Dashboard"]
[null,null,{"$f":"CurrentMonth","v":"2012-01-01"}]
[]
[]
[]
[]
[]
[]
[]
[]
[]
["Important:  Enable Macros to ensure the best experience while using this dashboard report."]
["This dashboard is compatible with Excel Versions 2007 and 2010.  Prior versions will not function properly."]

{"sheet":"Admin","index":1,"n_rows":7,"n_cols":9,"rows_kept":7,"cut":false,"hidden":false,"merged":[]}
[{"$f":"CurrentMonth","v":"2012-01-01"},null,null,null,"ADMINISTRATION"]
[]
["Accountability","Last 12 Months","Fiscal Year to Date","FYTD",null,"Human Resources","Last 12 Months","Fiscal Year to Date","FYTD"]
[{"$f":"'Admin Data'!A5","v":"Citizen Request Tracker Cases"},null,null,{"$f":"'Admin Data'!I41","v":19},null,{"$f":"'Admin Data'!A8","v":"Emergency Overtime Hours Worked By All Departments"},null,null,{"$f":"'Admin Data'!I44","v":192}]
[{"$f":"'Admin Data'!A6","v":"Quarterly Newsletters Published"},null,null,{"$f":"'Admin Data'!I42","v":3},null,{"$f":"'Admin Data'!A9","v":"Planned Overtime Hours Worked By All Departments"},null,null,{"$f":"'Admin Data'!I45","v":3511}]
[{"$f":"'Admin Data'!A7","v":"Public Performance Reports Issued"},null,null,{"$f":"'Admin Data'!I43","v":0},null,{"$f":"'Admin Data'!A10","v":"On-call Hours Worked By All Departments"},null,null,{"$f":"'Admin Data'!I46","v":2034.25}]
[null,null,null,null,null,{"$f":"'Admin Data'!A11","v":"Sick Leave Hours Used By All Departments"},null,null,{"$f":"'Admin Data'!I47","v":12500.529999999999}]

{"sheet":"Admin Data","index":2,"n_rows":87,"n_cols":44,"rows_kept":87,"cut":false,"hidden":false,"merged":[]}
["Admin Data"]
[]
[null,{"$f":"IF(ISEVEN(YEAR(B4+185)),1,0)","v":0},{"$f":"IF(ISEVEN(YEAR(C4+185)),1,0)","v":0},0,0,0,0,0,0,0,0,0,0,1,1,1,1,1,1,1,1,1,1,1,1,0,0,0,0,0,0,0,0,0,0,0,0,1,1,1,1,1,1,1]
["Measure","2008-07-01","2008-08-01","2008-09-01","2008-10-01","2008-11-01","2008-12-01","2009-01-01","2009-02-01","2009-03-01","2009-04-01","2009-05-01","2009-06-01","2009-07-01","2009-08-01","2009-09-01","2009-10-01","2009-11-01","2009-12-01","2010-01-01","2010-02-01","2010-03-01","2010-04-01","2010-05-01","2010-06-01","2010-07-01","2010-08-01","2010-09-01","2010-10-01","2010-11-01","2010-12-01","2011-01-01","2011-02-01","2011-03-01","2011-04-01","2011-05-01","2011-06-01","2011-07-01","2011-08-01","2011-09-01","2011-10-01","2011-11-01","2011-12-01","2012-01-01"]
["Citizen Request Tracker Cases",{"$error":"#N/A"},{"$error":"#N/A"},{"$error":"#N/A"},{"$error":"#N/A"},{"$error":"#N/A"},{"$error":"#N/A"},{"$error":"#N/A"},{"$error":"#N/A"},{"$error":"#N/A"},{"$error":"#N/A"},{"$error":"#N/A"},{"$error":"#N/A"},1,5,9,2,2,0,2,4,5,4,22,9,1,1,0,2,0,1,2,0,0,3,3,3,1,5,7,1,1,1,3]
["Quarterly Newsletters Published",1,0,0,1,0,0,1,0,0,1,0,0,1,0,0,1,0,0,1,0,0,1,0,0,1,0,0,1,0,0,1,0,0,1,0,0,1,0,0,1,0,0,1]
["Public Performance Reports Issued",0,0,0,0,0,0,0,0,0,0,0,0,0,0,0,0,0,0,0,0,0,0,0,0,0,0,0,0,0,0,0,0,0,0,0,0,0,0,0,0,0,0,0]
["Emergency Overtime Hours Worked By All Departments",{"$error":"#N/A"},{"$error":"#N/A"},{"$error":"#N/A"},{"$error":"#N/A"},{"$error":"#N/A"},{"$error":"#N/A"},{"$error":"#N/A"},{"$error":"#N/A"},{"$error":"#N/A"},{"$error":"#N/A"},{"$error":"#N/A"},{"$error":"#N/A"},352.75,394.25,217.5,223.5,159.5,363,247,378,176.5,112.5,249,346.5,615,193,388.5,435,370.5,412.75,314.5,219,401.75,574,490.75,484.25,192,0,0,0,0,0,0]
["Planned Overtime Hours Worked By All Departments",{"$error":"#N/A"},{"$error":"#N/A"},{"$error":"#N/A"},{"$error":"#N/A"},{"$error":"#N/A"},{"$error":"#N/A"},{"$error":"#N/A"},{"$error":"#N/A"},{"$error":"#N/A"},{"$error":"#N/A"},{"$error":"#N/A"},{"$error":"#N/A"},497.25,297.25,622.25,460.25,462.25,754.25,424.25,344.65,332.75,282.25,468.5,408,563.25,396.5,391.25,402,384,792.5,392.5,411,401,535.5,640.75,657.25,551.75,493.75,574.25,355.25,574.25,640.75,321]
["On-call Hours Worked By All Departments",{"$error":"#N/A"},{"$error":"#N/A"},{"$error":"#N/A"},{"$error":"#N/A"},{"$error":"#N/A"},{"$error":"#N/A"},{"$error":"#N/A"},{"$error":"#N/A"},{"$error":"#N/A"},{"$error":"#N/A"},{"$error":"#N/A"},{"$error":"#N/A"},426.75,260.5,264,292,321.75,410,354.5,303.25,296,279,259,276,450.5,283.5,307.5,279.5,279.25,433.75,321,288,279.5,262,279.25,398,266.5,253,265,273.5,273.25,418.5,284.5]
["Sick Leave Hours Used By All Departments",{"$error":"#N/A"},{"$error":"#N/A"},{"$error":"#N/A"},{"$error":"#N/A"},{"$error":"#N/A"},{"$error":"#N/A"},{"$error":"#N/A"},{"$error":"#N/A"},{"$error":"#N/A"},{"$error":"#N/A"},{"$error":"#N/A"},{"$error":"#N/A"},2135.09,1162.5,1130.3099999999995,1854.0900000000001,1157.8000000000011,1479,1238.0200000000004,1855.2899999999991,2136.5,1941.5,1682.7499999999982,1538.5,2713.69,1887.4999999999995,1534.0500000000002,1448.75,1426,2429.4000000000015,1525,1580.6499999999996,1753.05,1375.25,1523.75,2334.75,1467.5,1636,1537,1549.15,1971.4,2902.67,1436.81]
[]
[]
[]
[]
[]
[]
[]
[]
[]
[]
[]
[]
[]
[]
[]
["HIGHLIGHTS","2008-07-01","2008-08-01","2008-09-01","2008-10-01","2008-11-01","2008-12-01","2009-01-01","2009-02-01","2009-03-01","2009-04-01","2009-05-01","2009-06-01","2009-07-01","2009-08-01","2009-09-01","2009-10-01","2009-11-01","2009-12-01","2010-01-01","2010-02-01","2010-03-01","2010-04-01","2010-05-01","2010-06-01","2010-07-01","2010-08-01","2010-09-01","2010-10-01","2010-11-01","2010-12-01","2011-01-01","2011-02-01","2011-03-01","2011-04-01","2011-05-01","2011-06-01","2011-07-01","2011-08-01","2011-09-01","2011-10-01","2011-11-01","2011-12-01","2012-01-01"]
["Highlight 1",null,null,null,null,null,null,null,null,null,null,null,null,null,null,null,null,null,null,null,null,null,null,null,null,null,null,null,null,null,null,null,null,null,null,null,null,"1.  We completed demolition of two dilapidated homes in the North Towne area and began constuction of one new Habitat home at 407 Johnson St.","1.  Construction began on two new Habitat Homes being funded with CDBG funds.","1.  The City Manager, Assistant City Manager, and Assistant to the City Manager attended the International City/County Management Association (ICMA) annual conference in Milwaukee, WI.  The conference offered staff an opportunity to develop skills and keep up with trends in local government.","The City Manager, Assistant City Manager, and Assistant to the City Manager attended the Georgia City/County Management Association (GCCMA) annual conference in Augusta, GA.  The conference offered staff an opportunity to develop skills and keep up with trends in local government.","Construction was completed on the second Habitat for Humanity home, located at 407 Johnson St.  A Dedication Ceremony was held on November 22nd, where the keys were presented to the Shaw Family who worked on, and purchased the home.  Additionally, we acquired and cleared a property which will be the location of our fourth Habitat for Humanity Home.  The structure on the property, located at 23 Fairview St, had fallen into major disrepair and was the source of regular complaints to Code Enforcement staff.  Construction on the new home should begin early in 2012.",null,"Held Annual Council Visioning Session at the Clarence Brown Convention Center."]
["Highlight 2",null,null,null,null,null,null,null,null,null,null,null,null,null,null,null,null,null,null,null,null,null,null,null,null,null,null,null,null,null,null,null,null,null,null,null,null,"2.  Completed the new design for the Monthly Performance Dashboard.  Public distribution of the dashboard will begin in late August.","2.  We have received notification of award for the 2011 CDBG program.  $199,807 will be used for housing rehabilitation in the North Towne neighborhood.","2.  Issued a Request for Bid for Lighting Construction Services for municipal facilities.  The Bid is expected to be awarded in early November.","Hosted, along with the Police and Fire Departments, the groundbreaking ceremony for the new Public Safety Headquarters.","The City renewed its contract with UMR to provide health insurance for city employees and their families.  Costs to the City have increased, but the premiums will remain the same for employees.",null,"Held two montly Council Meetings."]
["Highlight 3",null,null,null,null,null,null,null,null,null,null,null,null,null,null,null,null,null,null,null,null,null,null,null,null,null,null,null,null,null,null,null,null,null,null,null,null,"3.  Use of the Citizen Request Tracker is lower than we would like.  Staff will increase efforts to publicize the Tracker to increase usage.","3.  Completed audit phase of lighting design study for municipal facilities.  Request for Bids to implement the recommendations are anticipated to be released in September.","3.  Citizen Request Tracker cases have been coming in more frequently as we had hoped.","Hosted employee appreciation lunches for all City employees.  Administration staff, alongside several staff members from Public Works, served over 300 city employees.","Four City employees completed Building Operator Certification courses at Gwinnett Tech.  The course presented students with information about the various components of structures, covering subjects such as building envelope, HVAC, lighting, and energy efficiency.  The course was paid for using grant funds from the Energy Efficiency and Conservation Block Grant.",null,"Began lighting retrofit/upgrade project in earnest.  Approximately 40% of the project is complete."]
["Highlight 4",null,null,null,null,null,null,null,null,null,null,null,null,null,null,null,null,null,null,null,null,null,null,null,null,null,null,null,null,null,null,null,null,null,null,null,null,"4.  Overtime, Sick, and On-call hours are lower than they were at this point last year, at least partly due to the fact that there were two pay periods in July this year, and three in July last year.",null,"4.  Held two regular council meetings this month.",null,"At the polls, City voters approved Sunday package sales of alcohol as well as the 2012 SPLOST."]
["Highlight 5",null,null,null,null,null,null,null,null,null,null,null,null,null,null,null,null,null,null,null,null,null,null,null,null,null,null,null,null,null,null,null,null,null,null,null,null,null,null,null,null,"Targeting the Georgia Municipal Association's \"Trend Setter\" award, City staff delivered a presentation on innovative strategies being employed at the Wastewater Treatment Plant.  While not ultimately selected, it was nonetheless an honor to be among the candidates."]
["Highlight 6",null,null,null,null,null,null,null,null,null,null,null,null,null,null,null,null,null,null,null,null,null,null,null,null,null,null,null,null,null,null,null,null,null,null,null,null,null,null,null,null,"Administration staff completed the design of the 2012 City Calendar which residents will be receiving in the coming weeks."]
["Highlight 7",null,null,null,null,null,null,null,null,null,null,null,null,null,null,null,null,null,null,null,null,null,null,null,null,null,null,null,null,null,null,null,null,null,null,null,null,null,null,null,null,"Administration staff continued to prepare for the upcoming Council visioning session to be held in July."]
["Highlight 8"]
["Highlights Concaetenation",{"$f":"B28&CHAR(10)&B29&CHAR(10)&B30&CHAR(10)&B31&CHAR(10)&B32&CHAR(10)&B33&CHAR(10)&B34&CHAR(10)&B35","v":"\n\n\n\n\n\n\n"},{"$f":"C28&CHAR(10)&C29&CHAR(10)&C30&CHAR(10)&C31&CHAR(10)&C32&CHAR(10)&C33&CHAR(10)&C34&CHAR(10)&C35","v":"\n\n\n\n\n\n\n"},"\n\n\n\n\n\n\n","\n\n\n\n\n\n\n","\n\n\n\n\n\n\n","\n\n\n\n\n\n\n","\n\n\n\n\n\n\n","\n\n\n\n\n\n\n","\n\n\n\n\n\n\n","\n\n\n\n\n\n\n","\n\n\n\n\n\n\n","\n\n\n\n\n\n\n","\n\n\n\n\n\n\n","\n\n\n\n\n\n\n","\n\n\n\n\n\n\n","\n\n\n\n\n\n\n","\n\n\n\n\n\n\n","\n\n\n\n\n\n\n","\n\n\n\n\n\n\n","\n\n\n\n\n\n\n","\n\n\n\n\n\n\n","\n\n\n\n\n\n\n","\n\n\n\n\n\n\n","\n\n\n\n\n\n\n","\n\n\n\n\n\n\n","\n\n\n\n\n\n\n","\n\n\n\n\n\n\n","\n\n\n\n\n\n\n","\n\n\n\n\n\n\n","\n\n\n\n\n\n\n","\n\n\n\n\n\n\n","\n\n\n\n\n\n\n","\n\n\n\n\n\n\n","\n\n\n\n\n\n\n","\n\n\n\n\n\n\n",{"$f":"AK28&CHAR(10)&CHAR(10)&AK29&CHAR(10)&CHAR(10)&AK30&CHAR(10)&CHAR(10)&AK31&CHAR(10)&CHAR(10)&AK32&CHAR(10)&CHAR(10)&AK33&CHAR(10)&CHAR(10)&AK34&CHAR(10)&CHAR(10)&AK35","v":"\n\n\n\n\n\n\n\n\n\n\n\n\n\n"},"1.  We completed demolition of two dilapidated homes in the North Towne area and began constuction of one new Habitat home at 407 Johnson St.\n\n2.  Completed the new design for the Monthly Performance Dashboard.  Public distribution of the dashboard will begin in late August.\n\n3.  Use of the Citizen Request Tracker is lower than we would like.  Staff will increase efforts to publicize the Tracker to increase usage.\n\n4.  Overtime, Sick, and On-call hours are lower than they were at this point last year, at least partly due to the fact that there were two pay periods in July this year, and three in July last year.\n\n\n\n\n\n\n\n","1.  Construction began on two new Habitat Homes being funded with CDBG funds.\n\n2.  We have received notification of award for the 2011 CDBG program.  $199,807 will be used for housing rehabilitation in the North Towne neighborhood.\n\n3.  Completed audit phase of lighting design study for municipal facilities.  Request for Bids to implement the recommendations are anticipated to be released in September.\n\n\n\n\n\n\n\n\n\n","1.  The City Manager, Assistant City Manager, and Assistant to the City Manager attended the International City/County Management Association (ICMA) annual conference in Milwaukee, WI.  The conference offered staff an opportunity to develop skills and keep up with trends in local government.\n\n2.  Issued a Request for Bid for Lighting Construction Services for municipal facilities.  The Bid is expected to be awarded in early November.\n\n3.  Citizen Request Tracker cases have been coming in more frequently as we had hoped.\n\n4.  Held two regular council meetings this month.\n\n\n\n\n\n\n\n","The City Manager, Assistant City Manager, and Assistant to the City Manager attended the Georgia City/County Management Association (GCCMA) annual conference in Augusta, GA.  The conference offered staff an opportunity to develop skills and keep up with trends in local government.\n\nHosted, along with the Police and Fire Departments, the groundbreaking ceremony for the new Public Safety Headquarters.\n\nHosted employee appreciation lunches for all City employees.  Administration staff, alongside several staff members from Public Works, served over 300 city employees.\n\n\n\n\n\n\n\n\n\n","Construction was completed on the second Habitat for Humanity home, located at 407 Johnson St.  A Dedication Ceremony was held on November 22nd, where the keys were presented to the Shaw Family who worked on, and purchased the home.  Additionally, we acquired and cleared a property which will be the location of our fourth Habitat for Humanity Home.  The structure on the property, located at 23 Fairview St, had fallen into major disrepair and was the source of regular complaints to Code Enforcement staff.  Construction on the new home should begin early in 2012.\n\nThe City renewed its contract with UMR to provide health insurance for city employees and their families.  Costs to the City have increased, but the premiums will remain the same for employees.\n\nFour City employees completed Building Operator Certification courses at Gwinnett Tech.  The course presented students with information about the various components of structures, covering subjects such as building envelope, HVAC, lighting, and energy efficiency.  The course was paid for using grant funds from the Energy Efficiency and Conservation Block Grant.\n\nAt the polls, City voters approved Sunday package sales of alcohol as well as the 2012 SPLOST.\n\nTargeting the Georgia Municipal Association's \"Trend Setter\" award, City staff delivered a presentation on innovative strategies being employed at the Wastewater Treatment Plant.  While not ultimately selected, it was nonetheless an honor to be among the candidates.\n\nAdministration staff completed the design of the 2012 City Calendar which residents will be receiving in the coming weeks.\n\nAdministration staff continued to prepare for the upcoming Council visioning session to be held in July.\n\n",{"$f":"AQ28&CHAR(10)&CHAR(10)&AQ29&CHAR(10)&CHAR(10)&AQ30&CHAR(10)&CHAR(10)&AQ31&CHAR(10)&CHAR(10)&AQ32&CHAR(10)&CHAR(10)&AQ33&CHAR(10)&CHAR(10)&AQ34&CHAR(10)&CHAR(10)&AQ35","v":"\n\n\n\n\n\n\n\n\n\n\n\n\n\n"},"Held Annual Council Visioning Session at the Clarence Brown Convention Center.\n\nHeld two montly Council Meetings.\n\nBegan lighting retrofit/upgrade project in earnest.  Approximately 40% of the project is complete.\n\n\n\n\n\n\n\n\n\n"]
[]
[]
[]
["Bullet Chart Source","Target","What's Better?","Band 1","Band 2","YTD Type","Max Scale","Actual 1","Actual","Actual 3","Projection 1","Projection 2","Projection 3","First Zone 1","First Zone 2","First Zone 3","Second Zone 1","Second Zone 2","Second Zone 3","Previous X 1","Previous X 2","Previous Y 1","Previous Y 2"]
[{"$f":"A5","v":"Citizen Request Tracker Cases"},60,"More",0.85,1,"Sum",{"$f":"ROUNDUP((ROUNDUP(MAX(B41,SUM(I41,L41)),-LEN(EVEN(MAX(B41,SUM(I41,L41))))+2)/5),-LEN(EVEN(ROUNDUP(MAX(B41,SUM(I41,L41)),-LEN(EVEN(MAX(B41,SUM(I41,L41))))+2)/5))+1)*5","v":100},0,{"$f":"IF(F41=\"Sum\",SUM(OFFSET(A5,0,YTDBeg,1,YTDWidth)),AVERAGE(OFFSET(A5,0,YTDBeg,1,YTDWidth)))","v":19},0,0,{"$f":"IF(F41=\"Sum\",Projection*(I41/YTDWidth*12-I41),0)","v":0},0,{"$f":"B41*D41","v":51},{"$f":"((I41+L41<=N41)*(N41-(I41+L41)))","v":32},{"$f":"N41","v":51},{"$f":"(E41-D41)*B41","v":9.0000000000000018},{"$f":"((I41+L41<=N41+Q41)*((N41+Q41)-(I41+L41+O41)))","v":9},{"$f":"Q41","v":9.0000000000000018},{"$f":"IF(F41=\"Sum\",SUM(OFFSET(A5,0,YTDBeg-12,1,YTDWidth)),AVERAGE(OFFSET(A5,0,YTDBeg-12,1,YTDWidth)))","v":7},{"$f":"T41","v":7},1,2]
[{"$f":"A6","v":"Quarterly Newsletters Published"},4,"Middle",0.95,1.05,"Sum",{"$f":"ROUNDUP((ROUNDUP(MAX(B42,SUM(I42,L42)),-LEN(EVEN(MAX(B42,SUM(I42,L42))))+2)/5),-LEN(EVEN(ROUNDUP(MAX(B42,SUM(I42,L42)),-LEN(EVEN(MAX(B42,SUM(I42,L42))))+2)/5))+1)*5","v":5},0,3,0,0,{"$f":"(4-I42)*Projection","v":0},0,3.8,{"$f":"((I42+L42<=N42)*(N42-(I42+L42)))","v":0.79999999999999982},{"$f":"N42","v":3.8},0.40000000000000036,{"$f":"((I42+L42<=N42+Q42)*((N42+Q42)-(I42+L42+O42)))","v":0.40000000000000036},{"$f":"Q42","v":0.40000000000000036},3,{"$f":"T42","v":3},1,2]
["Public Performance Reports Issued",12,"Middle",0.95,1.05,"Sum",15,0,0,0,0,{"$f":"IF(F43=\"Sum\",Projection*(I43/YTDWidth*12-I43),0)","v":0},0,11.399999999999999,11.399999999999999,11.399999999999999,1.2000000000000011,1.2000000000000011,1.2000000000000011,0,0,1,2]
["Emergency Overtime Hours Worked By All Departments",3800,"Less",1,1.1499999999999999,"Sum",4000,0,192,0,0,{"$f":"IF(F44=\"Sum\",Projection*(I44/YTDWidth*12-I44),0)","v":0},0,3800,3608,3800,569.99999999999966,570,569.99999999999966,2729.25,2729.25,1,2]
["Planned Overtime Hours Worked By All Departments",5200,"Less",1,1.1499999999999999,"Sum",10000,0,3511,0,0,{"$f":"IF(F45=\"Sum\",Projection*(I45/YTDWidth*12-I45),0)","v":0},0,5200,1689,5200,779.99999999999955,780,779.99999999999955,3322,3322,1,2]
["On-call Hours Worked By All Departments",3900,"Less",1,1.1499999999999999,"Sum",4000,0,2034.25,0,0,{"$f":"IF(F46=\"Sum\",Projection*(I46/YTDWidth*12-I46),0)","v":0},0,3900,1865.75,3900,584.99999999999966,585,584.99999999999966,2355,2355,1,2]
["Sick Leave Hours Used By All Departments",16680,"Less",1,1.1499999999999999,"Sum",20000,0,12500.529999999999,0,0,{"$f":"IF(F47=\"Sum\",Projection*(I47/YTDWidth*12-I47),0)","v":0},0,16680,4179.4700000000012,16680,2501.9999999999986,2502,2501.9999999999986,12964.390000000001,12964.390000000001,1,2]
[]
[]
[]
[]
[]
[]
[]
[]
[]
[]
[]
[]
[]
[]
[]
[]
[]
["SPARKLINE SOURCE"]
[null,11,10,9,8,7,6,5,4,3,2,1,0]
["Measure",{"$f":"OFFSET($A4,0,CurrentMonthCount-B$66,1,1)","v":"2011-02-01"},"2011-03-01","2011-04-01","2011-05-01","2011-06-01","2011-07-01","2011-08-01","2011-09-01","2011-10-01","2011-11-01","2011-12-01","2012-01-01"]
[{"$f":"A5","v":"Citizen Request Tracker Cases"},{"$f":"OFFSET($A5,0,CurrentMonthCount-B$66,1,1)","v":0},0,3,3,3,1,5,7,1,1,1,3]
[{"$f":"A6","v":"Quarterly Newsletters Published"},{"$f":"OFFSET($A6,0,CurrentMonthCount-B$66,1,1)","v":0},0,1,0,0,1,0,0,1,0,0,1]
["Public Performance Reports Issued",{"$f":"OFFSET($A7,0,CurrentMonthCount-B$66,1,1)","v":0},0,0,0,0,0,0,0,0,0,0,0]
["Emergency Overtime Hours Worked By All Departments",{"$f":"OFFSET($A8,0,CurrentMonthCount-B$66,1,1)","v":219},401.75,574,490.75,484.25,192,0,0,0,0,0,0]
["Planned Overtime Hours Worked By All Departments",{"$f":"OFFSET($A9,0,CurrentMonthCount-B$66,1,1)","v":411},401,535.5,640.75,657.25,551.75,493.75,574.25,355.25,574.25,640.75,321]
["On-call Hours Worked By All Departments",{"$f":"OFFSET($A10,0,CurrentMonthCount-B$66,1,1)","v":288},279.5,262,279.25,398,266.5,253,265,273.5,273.25,418.5,284.5]
["Sick Leave Hours Used By All Departments",{"$f":"OFFSET($A11,0,CurrentMonthCount-B$66,1,1)","v":1580.6499999999996},1753.05,1375.25,1523.75,2334.75,1467.5,1636,1537,1549.15,1971.4,2902.67,1436.81]
[0,{"$f":"OFFSET($A12,0,CurrentMonthCount-B$66,1,1)","v":0},0,0,0,0,0,0,0,0,0,0,0]
[0,{"$f":"OFFSET($A13,0,CurrentMonthCount-B$66,1,1)","v":0},0,0,0,0,0,0,0,0,0,0,0]
[0,{"$f":"OFFSET($A14,0,CurrentMonthCount-B$66,1,1)","v":0},0,0,0,0,0,0,0,0,0,0,0]
[0,{"$f":"OFFSET($A15,0,CurrentMonthCount-B$66,1,1)","v":0},0,0,0,0,0,0,0,0,0,0,0]
[0,{"$f":"OFFSET($A16,0,CurrentMonthCount-B$66,1,1)","v":0},0,0,0,0,0,0,0,0,0,0,0]
[0,{"$f":"OFFSET($A17,0,CurrentMonthCount-B$66,1,1)","v":0},0,0,0,0,0,0,0,0,0,0,0]
[0,{"$f":"OFFSET($A18,0,CurrentMonthCount-B$66,1,1)","v":0},0,0,0,0,0,0,0,0,0,0,0]
[0,{"$f":"OFFSET($A19,0,CurrentMonthCount-B$66,1,1)","v":0},0,0,0,0,0,0,0,0,0,0,0]
[0,{"$f":"OFFSET($A20,0,CurrentMonthCount-B$66,1,1)","v":0},0,0,0,0,0,0,0,0,0,0,0]
[0,{"$f":"OFFSET($A21,0,CurrentMonthCount-B$66,1,1)","v":0},0,0,0,0,0,0,0,0,0,0,0]
[0,{"$f":"OFFSET($A22,0,CurrentMonthCount-B$66,1,1)","v":0},0,0,0,0,0,0,0,0,0,0,0]
[0,{"$f":"OFFSET($A23,0,CurrentMonthCount-B$66,1,1)","v":0},0,0,0,0,0,0,0,0,0,0,0]
[0,{"$f":"OFFSET($A24,0,CurrentMonthCount-B$66,1,1)","v":0},0,0,0,0,0,0,0,0,0,0,0]

{"sheet":"Finance","index":3,"n_rows":13,"n_cols":9,"rows_kept":13,"cut":false,"hidden":false,"merged":[]}
[{"$f":"CurrentMonth","v":"2012-01-01"},null,null,null,"FINANCE"]
[]
["Meter Reading","Last 12 Months","Fiscal Year to Date","FYTD",null,"Accounting","Last 12 Months","Fiscal Year to Date","FYTD"]
[{"$f":"'Finance Data'!A5","v":"Meters Read - Electric"},null,null,{"$f":"'Finance Data'!I41","v":59235},null,{"$f":"'Finance Data'!A11","v":"Accounts Payable Invoices Processed"},null,null,{"$f":"'Finance Data'!I47","v":4521}]
[{"$f":"'Finance Data'!A6","v":"Meters Read - Gas"},null,null,{"$f":"'Finance Data'!I42","v":77335},null,{"$f":"'Finance Data'!A12","v":"Manual Journal Entries"},null,null,{"$f":"'Finance Data'!I48","v":445}]
[{"$f":"'Finance Data'!A7","v":"Meters Read - Water & Sewer"},null,null,{"$f":"'Finance Data'!I43","v":77213}]
[]
["Utility Servicing"]
[{"$f":"'Finance Data'!A8","v":"Service Disconnections"},null,null,{"$f":"'Finance Data'!I44","v":2134}]
[{"$f":"'Finance Data'!A9","v":"Service Connections"},null,null,{"$f":"'Finance Data'!I45","v":3479}]
[]
["Billling"]
[{"$f":"'Finance Data'!A10","v":"Bills Generated"},null,null,{"$f":"'Finance Data'!I46","v":106788}]

{"sheet":"Finance Data","index":4,"n_rows":87,"n_cols":44,"rows_kept":87,"cut":false,"hidden":false,"merged":[]}
["Finance Data"]
[]
[]
["Measure","2008-07-01","2008-08-01","2008-09-01","2008-10-01","2008-11-01","2008-12-01","2009-01-01","2009-02-01","2009-03-01","2009-04-01","2009-05-01","2009-06-01","2009-07-01","2009-08-01","2009-09-01","2009-10-01","2009-11-01","2009-12-01","2010-01-01","2010-02-01","2010-03-01","2010-04-01","2010-05-01","2010-06-01","2010-07-01","2010-08-01","2010-09-01","2010-10-01","2010-11-01","2010-12-01","2011-01-01","2011-02-01","2011-03-01","2011-04-01","2011-05-01","2011-06-01","2011-07-01","2011-08-01","2011-09-01","2011-10-01","2011-11-01","2011-12-01","2012-01-01"]
["Meters Read - Electric",{"$f":"NA()","v":{"$error":"#N/A"}},{"$f":"NA()","v":{"$error":"#N/A"}},{"$f":"NA()","v":{"$error":"#N/A"}},{"$f":"NA()","v":{"$error":"#N/A"}},{"$f":"NA()","v":{"$error":"#N/A"}},{"$f":"NA()","v":{"$error":"#N/A"}},{"$f":"NA()","v":{"$error":"#N/A"}},{"$f":"NA()","v":{"$error":"#N/A"}},{"$f":"NA()","v":{"$error":"#N/A"}},{"$f":"NA()","v":{"$error":"#N/A"}},{"$f":"NA()","v":{"$error":"#N/A"}},{"$f":"NA()","v":{"$error":"#N/A"}},{"$f":"NA()","v":{"$error":"#N/A"}},{"$f":"NA()","v":{"$error":"#N/A"}},{"$f":"NA()","v":{"$error":"#N/A"}},{"$f":"NA()","v":{"$error":"#N/A"}},{"$f":"NA()","v":{"$error":"#N/A"}},{"$f":"NA()","v":{"$error":"#N/A"}},{"$f":"NA()","v":{"$error":"#N/A"}},{"$f":"NA()","v":{"$error":"#N/A"}},{"$f":"NA()","v":{"$error":"#N/A"}},{"$f":"NA()","v":{"$error":"#N/A"}},{"$f":"NA()","v":{"$error":"#N/A"}},{"$f":"NA()","v":{"$error":"#N/A"}},{"$f":"NA()","v":{"$error":"#N/A"}},{"$f":"NA()","v":{"$error":"#N/A"}},{"$f":"NA()","v":{"$error":"#N/A"}},{"$f":"NA()","v":{"$error":"#N/A"}},{"$f":"NA()","v":{"$error":"#N/A"}},{"$f":"NA()","v":{"$error":"#N/A"}},{"$f":"NA()","v":{"$error":"#N/A"}},{"$f":"NA()","v":{"$error":"#N/A"}},{"$f":"NA()","v":{"$error":"#N/A"}},{"$f":"NA()","v":{"$error":"#N/A"}},{"$f":"NA()","v":{"$error":"#N/A"}},{"$f":"NA()","v":{"$error":"#N/A"}},7733,8594,7855,9115,9115,8401,8422]
["Meters Read - Gas",{"$f":"NA()","v":{"$error":"#N/A"}},{"$f":"NA()","v":{"$error":"#N/A"}},{"$f":"NA()","v":{"$error":"#N/A"}},{"$f":"NA()","v":{"$error":"#N/A"}},{"$f":"NA()","v":{"$error":"#N/A"}},{"$f":"NA()","v":{"$error":"#N/A"}},{"$f":"NA()","v":{"$error":"#N/A"}},{"$f":"NA()","v":{"$error":"#N/A"}},{"$f":"NA()","v":{"$error":"#N/A"}},{"$f":"NA()","v":{"$error":"#N/A"}},{"$f":"NA()","v":{"$error":"#N/A"}},{"$f":"NA()","v":{"$error":"#N/A"}},{"$f":"NA()","v":{"$error":"#N/A"}},{"$f":"NA()","v":{"$error":"#N/A"}},{"$f":"NA()","v":{"$error":"#N/A"}},{"$f":"NA()","v":{"$error":"#N/A"}},{"$f":"NA()","v":{"$error":"#N/A"}},{"$f":"NA()","v":{"$error":"#N/A"}},{"$f":"NA()","v":{"$error":"#N/A"}},{"$f":"NA()","v":{"$error":"#N/A"}},{"$f":"NA()","v":{"$error":"#N/A"}},{"$f":"NA()","v":{"$error":"#N/A"}},{"$f":"NA()","v":{"$error":"#N/A"}},{"$f":"NA()","v":{"$error":"#N/A"}},{"$f":"NA()","v":{"$error":"#N/A"}},{"$f":"NA()","v":{"$error":"#N/A"}},{"$f":"NA()","v":{"$error":"#N/A"}},{"$f":"NA()","v":{"$error":"#N/A"}},{"$f":"NA()","v":{"$error":"#N/A"}},{"$f":"NA()","v":{"$error":"#N/A"}},{"$f":"NA()","v":{"$error":"#N/A"}},{"$f":"NA()","v":{"$error":"#N/A"}},{"$f":"NA()","v":{"$error":"#N/A"}},{"$f":"NA()","v":{"$error":"#N/A"}},{"$f":"NA()","v":{"$error":"#N/A"}},{"$f":"NA()","v":{"$error":"#N/A"}},10586,11143,10694,11361,11361,11168,11022]
["Meters Read - Water & Sewer",{"$f":"NA()","v":{"$error":"#N/A"}},{"$f":"NA()","v":{"$error":"#N/A"}},{"$f":"NA()","v":{"$error":"#N/A"}},{"$f":"NA()","v":{"$error":"#N/A"}},{"$f":"NA()","v":{"$error":"#N/A"}},{"$f":"NA()","v":{"$error":"#N/A"}},{"$f":"NA()","v":{"$error":"#N/A"}},{"$f":"NA()","v":{"$error":"#N/A"}},{"$f":"NA()","v":{"$error":"#N/A"}},{"$f":"NA()","v":{"$error":"#N/A"}},{"$f":"NA()","v":{"$error":"#N/A"}},{"$f":"NA()","v":{"$error":"#N/A"}},{"$f":"NA()","v":{"$error":"#N/A"}},{"$f":"NA()","v":{"$error":"#N/A"}},{"$f":"NA()","v":{"$error":"#N/A"}},{"$f":"NA()","v":{"$error":"#N/A"}},{"$f":"NA()","v":{"$error":"#N/A"}},{"$f":"NA()","v":{"$error":"#N/A"}},{"$f":"NA()","v":{"$error":"#N/A"}},{"$f":"NA()","v":{"$error":"#N/A"}},{"$f":"NA()","v":{"$error":"#N/A"}},{"$f":"NA()","v":{"$error":"#N/A"}},{"$f":"NA()","v":{"$error":"#N/A"}},{"$f":"NA()","v":{"$error":"#N/A"}},{"$f":"NA()","v":{"$error":"#N/A"}},{"$f":"NA()","v":{"$error":"#N/A"}},{"$f":"NA()","v":{"$error":"#N/A"}},{"$f":"NA()","v":{"$error":"#N/A"}},{"$f":"NA()","v":{"$error":"#N/A"}},{"$f":"NA()","v":{"$error":"#N/A"}},{"$f":"NA()","v":{"$error":"#N/A"}},{"$f":"NA()","v":{"$error":"#N/A"}},{"$f":"NA()","v":{"$error":"#N/A"}},{"$f":"NA()","v":{"$error":"#N/A"}},{"$f":"NA()","v":{"$error":"#N/A"}},{"$f":"NA()","v":{"$error":"#N/A"}},10459,11085,10578,11515,11515,11063,10998]
["Service Disconnections",{"$f":"NA()","v":{"$error":"#N/A"}},{"$f":"NA()","v":{"$error":"#N/A"}},{"$f":"NA()","v":{"$error":"#N/A"}},{"$f":"NA()","v":{"$error":"#N/A"}},{"$f":"NA()","v":{"$error":"#N/A"}},{"$f":"NA()","v":{"$error":"#N/A"}},{"$f":"NA()","v":{"$error":"#N/A"}},{"$f":"NA()","v":{"$error":"#N/A"}},{"$f":"NA()","v":{"$error":"#N/A"}},{"$f":"NA()","v":{"$error":"#N/A"}},{"$f":"NA()","v":{"$error":"#N/A"}},{"$f":"NA()","v":{"$error":"#N/A"}},{"$f":"NA()","v":{"$error":"#N/A"}},{"$f":"NA()","v":{"$error":"#N/A"}},{"$f":"NA()","v":{"$error":"#N/A"}},{"$f":"NA()","v":{"$error":"#N/A"}},{"$f":"NA()","v":{"$error":"#N/A"}},{"$f":"NA()","v":{"$error":"#N/A"}},{"$f":"NA()","v":{"$error":"#N/A"}},{"$f":"NA()","v":{"$error":"#N/A"}},{"$f":"NA()","v":{"$error":"#N/A"}},{"$f":"NA()","v":{"$error":"#N/A"}},{"$f":"NA()","v":{"$error":"#N/A"}},{"$f":"NA()","v":{"$error":"#N/A"}},{"$f":"NA()","v":{"$error":"#N/A"}},{"$f":"NA()","v":{"$error":"#N/A"}},{"$f":"NA()","v":{"$error":"#N/A"}},{"$f":"NA()","v":{"$error":"#N/A"}},{"$f":"NA()","v":{"$error":"#N/A"}},{"$f":"NA()","v":{"$error":"#N/A"}},{"$f":"NA()","v":{"$error":"#N/A"}},{"$f":"NA()","v":{"$error":"#N/A"}},{"$f":"NA()","v":{"$error":"#N/A"}},{"$f":"NA()","v":{"$error":"#N/A"}},{"$f":"NA()","v":{"$error":"#N/A"}},{"$f":"NA()","v":{"$error":"#N/A"}},276,437,289,218,301,324,289]
["Service Connections",{"$f":"NA()","v":{"$error":"#N/A"}},{"$f":"NA()","v":{"$error":"#N/A"}},{"$f":"NA()","v":{"$error":"#N/A"}},{"$f":"NA()","v":{"$error":"#N/A"}},{"$f":"NA()","v":{"$error":"#N/A"}},{"$f":"NA()","v":{"$error":"#N/A"}},{"$f":"NA()","v":{"$error":"#N/A"}},{"$f":"NA()","v":{"$error":"#N/A"}},{"$f":"NA()","v":{"$error":"#N/A"}},{"$f":"NA()","v":{"$error":"#N/A"}},{"$f":"NA()","v":{"$error":"#N/A"}},{"$f":"NA()","v":{"$error":"#N/A"}},{"$f":"NA()","v":{"$error":"#N/A"}},{"$f":"NA()","v":{"$error":"#N/A"}},{"$f":"NA()","v":{"$error":"#N/A"}},{"$f":"NA()","v":{"$error":"#N/A"}},{"$f":"NA()","v":{"$error":"#N/A"}},{"$f":"NA()","v":{"$error":"#N/A"}},{"$f":"NA()","v":{"$error":"#N/A"}},{"$f":"NA()","v":{"$error":"#N/A"}},{"$f":"NA()","v":{"$error":"#N/A"}},{"$f":"NA()","v":{"$error":"#N/A"}},{"$f":"NA()","v":{"$error":"#N/A"}},{"$f":"NA()","v":{"$error":"#N/A"}},{"$f":"NA()","v":{"$error":"#N/A"}},{"$f":"NA()","v":{"$error":"#N/A"}},{"$f":"NA()","v":{"$error":"#N/A"}},{"$f":"NA()","v":{"$error":"#N/A"}},{"$f":"NA()","v":{"$error":"#N/A"}},{"$f":"NA()","v":{"$error":"#N/A"}},{"$f":"NA()","v":{"$error":"#N/A"}},{"$f":"NA()","v":{"$error":"#N/A"}},{"$f":"NA()","v":{"$error":"#N/A"}},{"$f":"NA()","v":{"$error":"#N/A"}},{"$f":"NA()","v":{"$error":"#N/A"}},{"$f":"NA()","v":{"$error":"#N/A"}},566,561,483,533,461,474,401]
["Bills Generated",{"$f":"NA()","v":{"$error":"#N/A"}},{"$f":"NA()","v":{"$error":"#N/A"}},{"$f":"NA()","v":{"$error":"#N/A"}},{"$f":"NA()","v":{"$error":"#N/A"}},{"$f":"NA()","v":{"$error":"#N/A"}},{"$f":"NA()","v":{"$error":"#N/A"}},{"$f":"NA()","v":{"$error":"#N/A"}},{"$f":"NA()","v":{"$error":"#N/A"}},{"$f":"NA()","v":{"$error":"#N/A"}},{"$f":"NA()","v":{"$error":"#N/A"}},{"$f":"NA()","v":{"$error":"#N/A"}},{"$f":"NA()","v":{"$error":"#N/A"}},{"$f":"NA()","v":{"$error":"#N/A"}},{"$f":"NA()","v":{"$error":"#N/A"}},{"$f":"NA()","v":{"$error":"#N/A"}},{"$f":"NA()","v":{"$error":"#N/A"}},{"$f":"NA()","v":{"$error":"#N/A"}},{"$f":"NA()","v":{"$error":"#N/A"}},{"$f":"NA()","v":{"$error":"#N/A"}},{"$f":"NA()","v":{"$error":"#N/A"}},{"$f":"NA()","v":{"$error":"#N/A"}},{"$f":"NA()","v":{"$error":"#N/A"}},{"$f":"NA()","v":{"$error":"#N/A"}},{"$f":"NA()","v":{"$error":"#N/A"}},{"$f":"NA()","v":{"$error":"#N/A"}},{"$f":"NA()","v":{"$error":"#N/A"}},{"$f":"NA()","v":{"$error":"#N/A"}},{"$f":"NA()","v":{"$error":"#N/A"}},{"$f":"NA()","v":{"$error":"#N/A"}},{"$f":"NA()","v":{"$error":"#N/A"}},{"$f":"NA()","v":{"$error":"#N/A"}},{"$f":"NA()","v":{"$error":"#N/A"}},{"$f":"NA()","v":{"$error":"#N/A"}},{"$f":"NA()","v":{"$error":"#N/A"}},{"$f":"NA()","v":{"$error":"#N/A"}},{"$f":"NA()","v":{"$error":"#N/A"}},15237,15335,15294,15239,15239,15184,15260]
["Accounts Payable Invoices Processed",{"$error":"#N/A"},{"$error":"#N/A"},{"$error":"#N/A"},{"$error":"#N/A"},{"$error":"#N/A"},{"$error":"#N/A"},{"$error":"#N/A"},{"$error":"#N/A"},{"$error":"#N/A"},{"$error":"#N/A"},{"$error":"#N/A"},{"$error":"#N/A"},{"$error":"#N/A"},{"$error":"#N/A"},{"$error":"#N/A"},{"$error":"#N/A"},{"$error":"#N/A"},{"$error":"#N/A"},{"$error":"#N/A"},{"$error":"#N/A"},{"$error":"#N/A"},{"$error":"#N/A"},{"$error":"#N/A"},{"$error":"#N/A"},{"$error":"#N/A"},{"$error":"#N/A"},{"$error":"#N/A"},{"$error":"#N/A"},{"$error":"#N/A"},{"$error":"#N/A"},{"$error":"#N/A"},{"$error":"#N/A"},{"$error":"#N/A"},{"$error":"#N/A"},{"$error":"#N/A"},{"$error":"#N/A"},730,956,688,616,525,593,413]
["Manual Journal Entries",{"$error":"#N/A"},{"$error":"#N/A"},{"$error":"#N/A"},{"$error":"#N/A"},{"$error":"#N/A"},{"$error":"#N/A"},{"$error":"#N/A"},{"$error":"#N/A"},{"$error":"#N/A"},{"$error":"#N/A"},{"$error":"#N/A"},{"$error":"#N/A"},{"$error":"#N/A"},{"$error":"#N/A"},{"$error":"#N/A"},{"$error":"#N/A"},{"$error":"#N/A"},{"$error":"#N/A"},{"$error":"#N/A"},{"$error":"#N/A"},{"$error":"#N/A"},{"$error":"#N/A"},{"$error":"#N/A"},{"$error":"#N/A"},{"$error":"#N/A"},{"$error":"#N/A"},{"$error":"#N/A"},{"$error":"#N/A"},{"$error":"#N/A"},{"$error":"#N/A"},{"$error":"#N/A"},{"$error":"#N/A"},{"$error":"#N/A"},{"$error":"#N/A"},{"$error":"#N/A"},{"$error":"#N/A"},74,75,62,64,64,56,50]
[]
[]
[]
[]
[]
[]
[]
[]
[]
[]
[]
[]
[]
[]
["HIGHLIGHTS","2008-07-01","2008-08-01","2008-09-01","2008-10-01","2008-11-01","2008-12-01","2009-01-01","2009-02-01","2009-03-01","2009-04-01","2009-05-01","2009-06-01","2009-07-01","2009-08-01","2009-09-01","2009-10-01","2009-11-01","2009-12-01","2010-01-01","2010-02-01","2010-03-01","2010-04-01","2010-05-01","2010-06-01","2010-07-01","2010-08-01","2010-09-01","2010-10-01","2010-11-01","2010-12-01","2011-01-01","2011-02-01","2011-03-01","2011-04-01","2011-05-01","2011-06-01","2011-07-01","2011-08-01","2011-09-01","2011-10-01","2011-11-01","2011-12-01","2012-01-01"]
["Highlight 1",null,null,null,null,null,null,null,null,null,null,null,null,null,null,null,null,null,null,null,null,null,null,null,null,null,null,null,null,null,null,null,null,null,null,null,null,"General Fund is showing a loss of $245,000 for September 2011, while the same time period for 2010 showed a loss of $359,000.  Property Tax collections along with Local Option Sales Tax collections are below September 2010 levels.  Overall General Fund revenues are down from September 2010 level by $106,000, while expenses for the same time period are down $220,000.\nWater Fund is showing a profit of $930,000 for September 2011, while September 2010 showed a profit of $745,000.  Overall Water Fund revenues are down from September 2010 by $78,000, while expenses are down by $258,000 from September 2010.\nGas Fund is showing a loss of $692,000 for September 2011, while the Gas Fund had a loss of $969,000 in September 2010.  Gas Fund revenues for September 2011 increased from September 2010 by $81,000, while expenses decreased $195,000 for the same time period.\nElectric Fund is showing a profit of $1.44 million for September 2011, while September 2010 showed a profit of $1.17 million.  Electric Fund revenues have increased for September 2011 by $1.21 million, while expenses increased by $58,000 for September 2011.\nStormwater Fund is sowing a profit of $27,000 for September 2011, while September 2010 showed a profit of $49,000.  Stormwater revenues have increased for September 2011 by $9,000, while expenses have increased by $31,000, due to the clean out work being performed on the railroad.\nSolid Waste is showing a profit of $103,000 for September 2011, while September 2010 showed a profit of $120,000.  September 2012 revenues decreased by $3,000, while September 2011 expenses increased by $14,000.\nFiber Fund is showing a profit for September 2011 of $133,000, while September 2010 showed a profit of $200,000.  September 2011 revenues decreased by $111,000 while September 2011 expenses decreased by $44,000.\nThe cash position for September 2011 decreased by $3.8 million from June 30, 2011 cash balances.  This is due largely to the decrease in our pension plan portfolio and the stock market. \n","1. General Fund is showing a loss of $245,000 for September 2011, while the same time period for 2010 showed a loss of $359,000.  Property Tax collections along with Local Option Sales Tax collections are below September 2010 levels.  Overall General Fund revenues are down from September 2010 level by $106,000, while expenses for the same time period are down $220,000.","General Fund is showing a loss of $245,000 for September 2011, while the same time period for 2010 showed a loss of $359,000.  Property Tax collections along with Local Option Sales Tax collections are below September 2010 levels.  Overall General Fund revenues are down from September 2010 level by $106,000, while expenses for the same time period are down $220,000.","Annual audit is underway.  Auditors are about 60% complete with field work.","The annual audit is well underway.  Auditors have now completed 100% of the field work.  Staff is currently awaiting a draft copy of the financial statements. ","Annual audit is complete.  There were no findings and the city was given a qualified opinion which is the best opinion that can be given by an audit firm.","The year-to-date financial review shows that the general fund, electric fund, fiber optics fund, solid waste fund, stormwater fund, and water and sewer fund are all showing a net income, while the gas and garage funds are showing a loss.  The gas fund always shows a loss until the colder winter months come along and gas usage increases."]
["Highlight 2",null,null,null,null,null,null,null,null,null,null,null,null,null,null,null,null,null,null,null,null,null,null,null,null,null,null,null,null,null,null,null,null,null,null,null,null,null,"2. Water Fund is showing a profit of $930,000 for September 2011, while September 2010 showed a profit of $745,000.  Overall Water Fund revenues are down from September 2010 by $78,000, while expenses are down by $258,000 from September 2010.","Water Fund is showing a profit of $930,000 for September 2011, while September 2010 showed a profit of $745,000.  Overall Water Fund revenues are down from September 2010 by $78,000, while expenses are down by $258,000 from September 2010.","The year-to-date financial review shows that the general fund, electric fund, fiber optics fund, garage fund, solid waste fund, stormwater fund, and water and sewer fund are all showing a net income, while the gas fund is showing a loss.  The gas fund always shows a loss until the colder winter months come along and gas usage increases.","The year-to-date financial review shows that the general fund, electric fund, fiber optics fund, solid waste fund, stormwater fund, and water and sewer fund are all showing a net income, while the gas and garage funds are showing a loss.  The gas fund always shows a loss until the colder winter months come along and gas usage increases.","The year-to-date financial review shows that the general fund, electric fund, fiber optics fund, solid waste fund, stormwater fund, and water and sewer fund are all showing a net income, while the gas and garage funds are showing a loss.  The gas fund always shows a loss until the colder winter months come along and gas usage increases."]
["Highlight 3",null,null,null,null,null,null,null,null,null,null,null,null,null,null,null,null,null,null,null,null,null,null,null,null,null,null,null,null,null,null,null,null,null,null,null,null,null,"3. Gas Fund is showing a loss of $692,000 for September 2011, while the Gas Fund had a loss of $969,000 in September 2010.  Gas Fund revenues for September 2011 increased from September 2010 by $81,000, while expenses decreased $195,000 for the same time period.","Gas Fund is showing a loss of $692,000 for September 2011, while the Gas Fund had a loss of $969,000 in September 2010.  Gas Fund revenues for September 2011 increased from September 2010 by $81,000, while expenses decreased $195,000 for the same time period."]
["Highlight 4",null,null,null,null,null,null,null,null,null,null,null,null,null,null,null,null,null,null,null,null,null,null,null,null,null,null,null,null,null,null,null,null,null,null,null,null,null,"4. Electric Fund is showing a profit of $1.44 million for September 2011, while September 2010 showed a profit of $1.17 million.  Electric Fund revenues have increased for September 2011 by $1.21 million, while expenses increased by $58,000 for September 2011.","Electric Fund is showing a profit of $1.44 million for September 2011, while September 2010 showed a profit of $1.17 million.  Electric Fund revenues have increased for September 2011 by $1.21 million, while expenses increased by $58,000 for September 2011."]
["Highlight 5",null,null,null,null,null,null,null,null,null,null,null,null,null,null,null,null,null,null,null,null,null,null,null,null,null,null,null,null,null,null,null,null,null,null,null,null,null,"5. Stormwater Fund is sowing a profit of $27,000 for September 2011, while September 2010 showed a profit of $49,000.  Stormwater revenues have increased for September 2011 by $9,000, while expenses have increased by $31,000, due to the clean out work being performed on the railroad.","Stormwater Fund is sowing a profit of $27,000 for September 2011, while September 2010 showed a profit of $49,000.  Stormwater revenues have increased for September 2011 by $9,000, while expenses have increased by $31,000, due to the clean out work being performed on the railroad."]
["Highlight 6",null,null,null,null,null,null,null,null,null,null,null,null,null,null,null,null,null,null,null,null,null,null,null,null,null,null,null,null,null,null,null,null,null,null,null,null,null,"6. Solid Waste is showing a profit of $103,000 for September 2011, while September 2010 showed a profit of $120,000.  September 2012 revenues decreased by $3,000, while September 2011 expenses increased by $14,000.","Solid Waste is showing a profit of $103,000 for September 2011, while September 2010 showed a profit of $120,000.  September 2012 revenues decreased by $3,000, while September 2011 expenses increased by $14,000."]
["Highlight 7",null,null,null,null,null,null,null,null,null,null,null,null,null,null,null,null,null,null,null,null,null,null,null,null,null,null,null,null,null,null,null,null,null,null,null,null,null,"7. Fiber Fund is showing a profit for September 2011 of $133,000, while September 2010 showed a profit of $200,000.  September 2011 revenues decreased by $111,000 while September 2011 expenses decreased by $44,000.","Fiber Fund is showing a profit for September 2011 of $133,000, while September 2010 showed a profit of $200,000.  September 2011 revenues decreased by $111,000 while September 2011 expenses decreased by $44,000."]
["Highlight 8",null,null,null,null,null,null,null,null,null,null,null,null,null,null,null,null,null,null,null,null,null,null,null,null,null,null,null,null,null,null,null,null,null,null,null,null,null,"8. The cash position for September 2011 decreased by $3.8 million from June 30, 2011 cash balances.  This is due largely to the decrease in our pension plan portfolio and the stock market. ","The cash position for September 2011 decreased by $3.8 million from June 30, 2011 cash balances.  This is due largely to the decrease in our pension plan portfolio and the stock market. "]
["Highlights Concaetenation",{"$f":"B28&CHAR(10)&CHAR(10)&B29&CHAR(10)&CHAR(10)&B30&CHAR(10)&CHAR(10)&B31&CHAR(10)&CHAR(10)&B32&CHAR(10)&CHAR(10)&B33&CHAR(10)&CHAR(10)&B34&CHAR(10)&CHAR(10)&B35","v":"\n\n\n\n\n\n\n\n\n\n\n\n\n\n"},"\n\n\n\n\n\n\n\n\n\n\n\n\n\n","\n\n\n\n\n\n\n\n\n\n\n\n\n\n","\n\n\n\n\n\n\n\n\n\n\n\n\n\n","\n\n\n\n\n\n\n\n\n\n\n\n\n\n","\n\n\n\n\n\n\n\n\n\n\n\n\n\n","\n\n\n\n\n\n\n\n\n\n\n\n\n\n","\n\n\n\n\n\n\n\n\n\n\n\n\n\n","\n\n\n\n\n\n\n\n\n\n\n\n\n\n","\n\n\n\n\n\n\n\n\n\n\n\n\n\n","\n\n\n\n\n\n\n\n\n\n\n\n\n\n","\n\n\n\n\n\n\n\n\n\n\n\n\n\n","\n\n\n\n\n\n\n\n\n\n\n\n\n\n","\n\n\n\n\n\n\n\n\n\n\n\n\n\n","\n\n\n\n\n\n\n\n\n\n\n\n\n\n","\n\n\n\n\n\n\n\n\n\n\n\n\n\n","\n\n\n\n\n\n\n\n\n\n\n\n\n\n","\n\n\n\n\n\n\n\n\n\n\n\n\n\n","\n\n\n\n\n\n\n\n\n\n\n\n\n\n","\n\n\n\n\n\n\n\n\n\n\n\n\n\n","\n\n\n\n\n\n\n\n\n\n\n\n\n\n","\n\n\n\n\n\n\n\n\n\n\n\n\n\n","\n\n\n\n\n\n\n\n\n\n\n\n\n\n","\n\n\n\n\n\n\n\n\n\n\n\n\n\n","\n\n\n\n\n\n\n\n\n\n\n\n\n\n","\n\n\n\n\n\n\n\n\n\n\n\n\n\n","\n\n\n\n\n\n\n\n\n\n\n\n\n\n","\n\n\n\n\n\n\n\n\n\n\n\n\n\n","\n\n\n\n\n\n\n\n\n\n\n\n\n\n","\n\n\n\n\n\n\n\n\n\n\n\n\n\n","\n\n\n\n\n\n\n\n\n\n\n\n\n\n","\n\n\n\n\n\n\n\n\n\n\n\n\n\n","\n\n\n\n\n\n\n\n\n\n\n\n\n\n","\n\n\n\n\n\n\n\n\n\n\n\n\n\n","\n\n\n\n\n\n\n\n\n\n\n\n\n\n","\n\n\n\n\n\n\n\n\n\n\n\n\n\n","General Fund is showing a loss of $245,000 for September 2011, while the same time period for 2010 showed a loss of $359,000.  Property Tax collections along with Local Option Sales Tax collections are below September 2010 levels.  Overall General Fund revenues are down from September 2010 level by $106,000, while expenses for the same time period are down $220,000.\nWater Fund is showing a profit of $930,000 for September 2011, while September 2010 showed a profit of $745,000.  Overall Water Fund revenues are down from September 2010 by $78,000, while expenses are down by $258,000 from September 2010.\nGas Fund is showing a loss of $692,000 for September 2011, while the Gas Fund had a loss of $969,000 in September 2010.  Gas Fund revenues for September 2011 increased from September 2010 by $81,000, while expenses decreased $195,000 for the same time period.\nElectric Fund is showing a profit of $1.44 million for September 2011, while September 2010 showed a profit of $1.17 million.  Electric Fund revenues have increased for September 2011 by $1.21 million, while expenses increased by $58,000 for September 2011.\nStormwater Fund is sowing a profit of $27,000 for September 2011, while September 2010 showed a profit of $49,000.  Stormwater revenues have increased for September 2011 by $9,000, while expenses have increased by $31,000, due to the clean out work being performed on the railroad.\nSolid Waste is showing a profit of $103,000 for September 2011, while September 2010 showed a profit of $120,000.  September 2012 revenues decreased by $3,000, while September 2011 expenses increased by $14,000.\nFiber Fund is showing a profit for September 2011 of $133,000, while September 2010 showed a profit of $200,000.  September 2011 revenues decreased by $111,000 while September 2011 expenses decreased by $44,000.\nThe cash position for September 2011 decreased by $3.8 million from June 30, 2011 cash balances.  This is due largely to the decrease in our pension plan portfolio and the stock market. \n\n\n\n\n\n\n\n\n\n\n\n\n\n\n",{"$f":"AM28&CHAR(10)&CHAR(10)&AM29&CHAR(10)&CHAR(10)&AM30&CHAR(10)&CHAR(10)&AM31&CHAR(10)&CHAR(10)&AM32&CHAR(10)&CHAR(10)&AM33&CHAR(10)&CHAR(10)&AM34&CHAR(10)&CHAR(10)&AM35","v":"1. General Fund is showing a loss of $245,000 for September 2011, while the same time period for 2010 showed a loss of $359,000.  Property Tax collections along with Local Option Sales Tax collections are below September 2010 levels.  Overall General Fund revenues are down from September 2010 level by $106,000, while expenses for the same time period are down $220,000.\n\n2. Water Fund is showing a profit of $930,000 for September 2011, while September 2010 showed a profit of $745,000.  Overall Water Fund revenues are down from September 2010 by $78,000, while expenses are down by $258,000 from September 2010.\n\n3. Gas Fund is showing a loss of $692,000 for September 2011, while the Gas Fund had a loss of $969,000 in September 2010.  Gas Fund revenues for September 2011 increased from September 2010 by $81,000, while expenses decreased $195,000 for the same time period.\n\n4. Electric Fund is showing a profit of $1.44 million for September 2011, while September 2010 showed a profit of $1.17 million.  Electric Fund revenues have increased for September 2011 by $1.21 million, while expenses increased by $58,000 for September 2011.\n\n5. Stormwater Fund is sowing a profit of $27,000 for September 2011, while September 2010 showed a profit of $49,000.  Stormwater revenues have increased for September 2011 by $9,000, while expenses have increased by $31,000, due to the clean out work being performed on the railroad.\n\n6. Solid Waste is showing a profit of $103,000 for September 2011, while September 2010 showed a profit of $120,000.  September 2012 revenues decreased by $3,000, while September 2011 expenses increased by $14,000.\n\n7. Fiber Fund is showing a profit for September 2011 of $133,000, while September 2010 showed a profit of $200,000.  September 2011 revenues decreased by $111,000 while September 2011 expenses decreased by $44,000.\n\n8. The cash position for September 2011 decreased by $3.8 million from June 30, 2011 cash balances.  This is due largely to the decrease in our pension plan portfolio and the stock market. "},"General Fund is showing a loss of $245,000 for September 2011, while the same time period for 2010 showed a loss of $359,000.  Property Tax collections along with Local Option Sales Tax collections are below September 2010 levels.  Overall General Fund revenues are down from September 2010 level by $106,000, while expenses for the same time period are down $220,000.\n\nWater Fund is showing a profit of $930,000 for September 2011, while September 2010 showed a profit of $745,000.  Overall Water Fund revenues are down from September 2010 by $78,000, while expenses are down by $258,000 from September 2010.\n\nGas Fund is showing a loss of $692,000 for September 2011, while the Gas Fund had a loss of $969,000 in September 2010.  Gas Fund revenues for September 2011 increased from September 2010 by $81,000, while expenses decreased $195,000 for the same time period.\n\nElectric Fund is showing a profit of $1.44 million for September 2011, while September 2010 showed a profit of $1.17 million.  Electric Fund revenues have increased for September 2011 by $1.21 million, while expenses increased by $58,000 for September 2011.\n\nStormwater Fund is sowing a profit of $27,000 for September 2011, while September 2010 showed a profit of $49,000.  Stormwater revenues have increased for September 2011 by $9,000, while expenses have increased by $31,000, due to the clean out work being performed on the railroad.\n\nSolid Waste is showing a profit of $103,000 for September 2011, while September 2010 showed a profit of $120,000.  September 2012 revenues decreased by $3,000, while September 2011 expenses increased by $14,000.\n\nFiber Fund is showing a profit for September 2011 of $133,000, while September 2010 showed a profit of $200,000.  September 2011 revenues decreased by $111,000 while September 2011 expenses decreased by $44,000.\n\nThe cash position for September 2011 decreased by $3.8 million from June 30, 2011 cash balances.  This is due largely to the decrease in our pension plan portfolio and the stock market. ","Annual audit is underway.  Auditors are about 60% complete with field work.\n\nThe year-to-date financial review shows that the general fund, electric fund, fiber optics fund, garage fund, solid waste fund, stormwater fund, and water and sewer fund are all showing a net income, while the gas fund is showing a loss.  The gas fund always shows a loss until the colder winter months come along and gas usage increases.\n\n\n\n\n\n\n\n\n\n\n\n","The annual audit is well underway.  Auditors have now completed 100% of the field work.  Staff is currently awaiting a draft copy of the financial statements. \n\nThe year-to-date financial review shows that the general fund, electric fund, fiber optics fund, solid waste fund, stormwater fund, and water and sewer fund are all showing a net income, while the gas and garage funds are showing a loss.  The gas fund always shows a loss until the colder winter months come along and gas usage increases.\n\n\n\n\n\n\n\n\n\n\n\n","Annual audit is complete.  There were no findings and the city was given a qualified opinion which is the best opinion that can be given by an audit firm.\n\nThe year-to-date financial review shows that the general fund, electric fund, fiber optics fund, solid waste fund, stormwater fund, and water and sewer fund are all showing a net income, while the gas and garage funds are showing a loss.  The gas fund always shows a loss until the colder winter months come along and gas usage increases.\n\n\n\n\n\n\n\n\n\n\n\n","The year-to-date financial review shows that the general fund, electric fund, fiber optics fund, solid waste fund, stormwater fund, and water and sewer fund are all showing a net income, while the gas and garage funds are showing a loss.  The gas fund always shows a loss until the colder winter months come along and gas usage increases.\n\n\n\n\n\n\n\n\n\n\n\n\n\n"]
[]
[]
[]
["Bullet Chart Source","Target","What's Better?","Band 1","Band 2","YTD Type","Max Scale","Actual 1","Actual","Actual 3","Projection 1","Projection 2","Projection 3","First Zone 1","First Zone 2","First Zone 3","Second Zone 1","Second Zone 2","Second Zone 3","Previous X 1","Previous X 2","Previous Y 1","Previous Y 2"]
[{"$f":"A5","v":"Meters Read - Electric"},105000,"Middle",0.93,1.07,"Sum",{"$f":"ROUNDUP((ROUNDUP(MAX(B41,SUM(I41,L41)),-LEN(EVEN(MAX(B41,SUM(I41,L41))))+2)/5),-LEN(EVEN(ROUNDUP(MAX(B41,SUM(I41,L41)),-LEN(EVEN(MAX(B41,SUM(I41,L41))))+2)/5))+1)*5","v":150000},0,{"$f":"IF(F41=\"Sum\",SUM(OFFSET(A5,0,YTDBeg,1,YTDWidth)),AVERAGE(OFFSET(A5,0,YTDBeg,1,YTDWidth)))","v":59235},0,0,{"$f":"IF(F41=\"Sum\",Projection*(I41/YTDWidth*12-I41),0)","v":0},0,{"$f":"B41*D41","v":97650},{"$f":"((I41+L41<=N41)*(N41-(I41+L41)))","v":38415},{"$f":"N41","v":97650},{"$f":"(E41-D41)*B41","v":14700.000000000002},{"$f":"((I41+L41<=N41+Q41)*((N41+Q41)-(I41+L41+O41)))","v":14700},{"$f":"Q41","v":14700.000000000002},{"$f":"IF(F41=\"Sum\",SUM(OFFSET(A5,0,YTDBeg-12,1,YTDWidth)),AVERAGE(OFFSET(A5,0,YTDBeg-12,1,YTDWidth)))","v":{"$error":"#N/A"}},{"$f":"T41","v":{"$error":"#N/A"}},1,2]
[{"$f":"A6","v":"Meters Read - Gas"},128500,"Middle",0.93,1.07,"Sum",{"$f":"ROUNDUP((ROUNDUP(MAX(B42,SUM(I42,L42)),-LEN(EVEN(MAX(B42,SUM(I42,L42))))+2)/5),-LEN(EVEN(ROUNDUP(MAX(B42,SUM(I42,L42)),-LEN(EVEN(MAX(B42,SUM(I42,L42))))+2)/5))+1)*5","v":150000},0,77335,0,0,0,0,119505,{"$f":"((I42+L42<=N42)*(N42-(I42+L42)))","v":42170},{"$f":"N42","v":119505},17990,{"$f":"((I42+L42<=N42+Q42)*((N42+Q42)-(I42+L42+O42)))","v":17990},{"$f":"Q42","v":17990},{"$error":"#N/A"},{"$f":"T42","v":{"$error":"#N/A"}},1,2]
["Meters Read - Water & Sewer",131500,"Middle",0.93,1.07,"Sum",150000,0,77213,0,0,0,0,122295,45082,122295,18410,18410,18410,{"$error":"#N/A"},{"$error":"#N/A"},1,2]
["Service Disconnections",5100,"Less",1,1.1499999999999999,"Sum",10000,0,2134,0,0,0,0,5100,2966,5100,764.99999999999955,765,764.99999999999955,{"$error":"#N/A"},{"$error":"#N/A"},1,2]
["Service Connections",5000,"More",0.85,1,"Sum",5000,0,3479,0,0,0,0,4250,771,4250,750.00000000000011,750,750.00000000000011,{"$error":"#N/A"},{"$error":"#N/A"},1,2]
["Bills Generated",183000,"Middle",0.93,1.07,"Sum",200000,0,106788,0,0,0,0,170190,63402,170190,25620.000000000004,25620,25620.000000000004,{"$error":"#N/A"},{"$error":"#N/A"},1,2]
["Accounts Payable Invoices Processed",11500,"Middle",0.93,1.07,"Sum",15000,0,4521,0,0,0,0,10695,6174,10695,1610.0000000000002,1610,1610.0000000000002,{"$error":"#N/A"},{"$error":"#N/A"},1,2]
["Manual Journal Entries",1110,"Less",1,1.1499999999999999,"Sum",1500,0,445,0,0,0,0,1110,665,1110,166.49999999999991,166.5,166.49999999999991,{"$error":"#N/A"},{"$error":"#N/A"},1,2]
[]
[]
[]
[]
[]
[]
[]
[]
[]
[]
[]
[]
[]
[]
[]
[]
["SPARKLINE SOURCE"]
[null,11,10,9,8,7,6,5,4,3,2,1,0]
["Measure",{"$f":"OFFSET($A4,0,CurrentMonthCount-B$66,1,1)","v":"2011-02-01"},"2011-03-01","2011-04-01","2011-05-01","2011-06-01","2011-07-01","2011-08-01","2011-09-01","2011-10-01","2011-11-01","2011-12-01","2012-01-01"]
[{"$f":"A5","v":"Meters Read - Electric"},{"$f":"OFFSET($A5,0,CurrentMonthCount-B$66,1,1)","v":{"$error":"#N/A"}},{"$error":"#N/A"},{"$error":"#N/A"},{"$error":"#N/A"},{"$error":"#N/A"},7733,8594,7855,9115,9115,8401,8422]
[{"$f":"A6","v":"Meters Read - Gas"},{"$f":"OFFSET($A6,0,CurrentMonthCount-B$66,1,1)","v":{"$error":"#N/A"}},{"$error":"#N/A"},{"$error":"#N/A"},{"$error":"#N/A"},{"$error":"#N/A"},10586,11143,10694,11361,11361,11168,11022]
["Meters Read - Water & Sewer",{"$f":"OFFSET($A7,0,CurrentMonthCount-B$66,1,1)","v":{"$error":"#N/A"}},{"$error":"#N/A"},{"$error":"#N/A"},{"$error":"#N/A"},{"$error":"#N/A"},10459,11085,10578,11515,11515,11063,10998]
["Service Disconnections",{"$f":"OFFSET($A8,0,CurrentMonthCount-B$66,1,1)","v":{"$error":"#N/A"}},{"$error":"#N/A"},{"$error":"#N/A"},{"$error":"#N/A"},{"$error":"#N/A"},276,437,289,218,301,324,289]
["Service Connections",{"$f":"OFFSET($A9,0,CurrentMonthCount-B$66,1,1)","v":{"$error":"#N/A"}},{"$error":"#N/A"},{"$error":"#N/A"},{"$error":"#N/A"},{"$error":"#N/A"},566,561,483,533,461,474,401]
["Bills Generated",{"$f":"OFFSET($A10,0,CurrentMonthCount-B$66,1,1)","v":{"$error":"#N/A"}},{"$error":"#N/A"},{"$error":"#N/A"},{"$error":"#N/A"},{"$error":"#N/A"},15237,15335,15294,15239,15239,15184,15260]
["Accounts Payable Invoices Processed",{"$f":"OFFSET($A11,0,CurrentMonthCount-B$66,1,1)","v":{"$error":"#N/A"}},{"$error":"#N/A"},{"$error":"#N/A"},{"$error":"#N/A"},{"$error":"#N/A"},730,956,688,616,525,593,413]
["Manual Journal Entries",{"$f":"OFFSET($A12,0,CurrentMonthCount-B$66,1,1)","v":{"$error":"#N/A"}},{"$error":"#N/A"},{"$error":"#N/A"},{"$error":"#N/A"},{"$error":"#N/A"},74,75,62,64,64,56,50]
[0,{"$f":"OFFSET($A13,0,CurrentMonthCount-B$66,1,1)","v":0},0,0,0,0,0,0,0,0,0,0,0]
[0,{"$f":"OFFSET($A14,0,CurrentMonthCount-B$66,1,1)","v":0},0,0,0,0,0,0,0,0,0,0,0]
[0,{"$f":"OFFSET($A15,0,CurrentMonthCount-B$66,1,1)","v":0},0,0,0,0,0,0,0,0,0,0,0]
[0,{"$f":"OFFSET($A16,0,CurrentMonthCount-B$66,1,1)","v":0},0,0,0,0,0,0,0,0,0,0,0]
[0,{"$f":"OFFSET($A17,0,CurrentMonthCount-B$66,1,1)","v":0},0,0,0,0,0,0,0,0,0,0,0]
[0,{"$f":"OFFSET($A18,0,CurrentMonthCount-B$66,1,1)","v":0},0,0,0,0,0,0,0,0,0,0,0]
[0,{"$f":"OFFSET($A19,0,CurrentMonthCount-B$66,1,1)","v":0},0,0,0,0,0,0,0,0,0,0,0]
[0,{"$f":"OFFSET($A20,0,CurrentMonthCount-B$66,1,1)","v":0},0,0,0,0,0,0,0,0,0,0,0]
[0,{"$f":"OFFSET($A21,0,CurrentMonthCount-B$66,1,1)","v":0},0,0,0,0,0,0,0,0,0,0,0]
[0,{"$f":"OFFSET($A22,0,CurrentMonthCount-B$66,1,1)","v":0},0,0,0,0,0,0,0,0,0,0,0]
[0,{"$f":"OFFSET($A23,0,CurrentMonthCount-B$66,1,1)","v":0},0,0,0,0,0,0,0,0,0,0,0]
[0,{"$f":"OFFSET($A24,0,CurrentMonthCount-B$66,1,1)","v":0},0,0,0,0,0,0,0,0,0,0,0]

{"sheet":"CustServ","index":5,"n_rows":14,"n_cols":9,"rows_kept":14,"cut":false,"hidden":false,"merged":[]}
[{"$f":"CurrentMonth","v":"2012-01-01"},null,null,null,"CUSTOMER SERVICE"]
[]
["Transactions","Last 12 Months","Fiscal Year to Date","FYTD",null,"Customer Service","Last 12 Months","Fiscal Year to Date","FYTD"]
[{"$f":"'CustServ Data'!A7","v":"Payments - Walk-in and Drive-thru"},null,null,{"$f":"'CustServ Data'!I43","v":51382},null,{"$f":"'CustServ Data'!A5","v":"Complaints Against Customer Service Reps"},null,null,{"$f":"'CustServ Data'!I41","v":7}]
[{"$f":"'CustServ Data'!A8","v":"Payments - Webpay"},null,null,{"$f":"'CustServ Data'!I44","v":14375},null,{"$f":"'CustServ Data'!A6","v":"Pro-Corp Calls (after hours) - Talk Time in Minutes"},null,null,{"$f":"'CustServ Data'!I42","v":11272}]
[{"$f":"'CustServ Data'!A9","v":"Payments - Bank Bill Pay"},null,null,{"$f":"'CustServ Data'!I45","v":9136}]
[{"$f":"'CustServ Data'!A10","v":"Payments - Drop Box (after hours)"},null,null,{"$f":"'CustServ Data'!I46","v":7388}]
[{"$f":"'CustServ Data'!A11","v":"Payments - Mail"},null,null,{"$f":"'CustServ Data'!I47","v":25900}]
[{"$f":"'CustServ Data'!A12","v":"Payments - Wired Cash"},null,null,{"$f":"'CustServ Data'!I48","v":222}]
[{"$f":"'CustServ Data'!A13","v":"Payments - Auto Bank Draft"},null,null,{"$f":"'CustServ Data'!I49","v":5795}]
[{"$f":"'CustServ Data'!A14","v":"Billing Errors"},null,null,{"$f":"'CustServ Data'!I50","v":46}]
[{"$f":"'CustServ Data'!A15","v":"Cash Drawer Over-Under"},null,null,{"$f":"'CustServ Data'!I51","v":-20.96}]
[{"$f":"'CustServ Data'!A16","v":"Service Disconnections (Transactions)"},null,null,{"$f":"'CustServ Data'!I52","v":2134}]
[{"$f":"'CustServ Data'!A17","v":"Service Connections (Transactions)"},null,null,{"$f":"'CustServ Data'!I53","v":3479}]

{"sheet":"CustServ Data","index":6,"n_rows":103,"n_cols":44,"rows_kept":103,"cut":false,"hidden":false,"merged":[]}
["CustServ Data"]
[]
[]
["Measure","2008-07-01","2008-08-01","2008-09-01","2008-10-01","2008-11-01","2008-12-01","2009-01-01","2009-02-01","2009-03-01","2009-04-01","2009-05-01","2009-06-01","2009-07-01","2009-08-01","2009-09-01","2009-10-01","2009-11-01","2009-12-01","2010-01-01","2010-02-01","2010-03-01","2010-04-01","2010-05-01","2010-06-01","2010-07-01","2010-08-01","2010-09-01","2010-10-01","2010-11-01","2010-12-01","2011-01-01","2011-02-01","2011-03-01","2011-04-01","2011-05-01","2011-06-01","2011-07-01","2011-08-01","2011-09-01","2011-10-01","2011-11-01","2011-12-01","2012-01-01"]
["Complaints Against Customer Service Reps",{"$error":"#N/A"},{"$error":"#N/A"},{"$error":"#N/A"},{"$error":"#N/A"},{"$error":"#N/A"},{"$error":"#N/A"},{"$error":"#N/A"},{"$error":"#N/A"},{"$error":"#N/A"},{"$error":"#N/A"},{"$error":"#N/A"},{"$error":"#N/A"},{"$error":"#N/A"},{"$error":"#N/A"},{"$error":"#N/A"},{"$error":"#N/A"},{"$error":"#N/A"},{"$error":"#N/A"},{"$error":"#N/A"},{"$error":"#N/A"},{"$error":"#N/A"},{"$error":"#N/A"},{"$error":"#N/A"},{"$error":"#N/A"},{"$error":"#N/A"},{"$error":"#N/A"},{"$error":"#N/A"},{"$error":"#N/A"},{"$error":"#N/A"},{"$error":"#N/A"},{"$error":"#N/A"},{"$error":"#N/A"},{"$error":"#N/A"},{"$error":"#N/A"},{"$error":"#N/A"},{"$error":"#N/A"},2,1,0,0,1,2,1]
["Pro-Corp Calls (after hours) - Talk Time in Minutes",{"$error":"#N/A"},{"$error":"#N/A"},{"$error":"#N/A"},{"$error":"#N/A"},{"$error":"#N/A"},{"$error":"#N/A"},{"$error":"#N/A"},{"$error":"#N/A"},{"$error":"#N/A"},{"$error":"#N/A"},{"$error":"#N/A"},{"$error":"#N/A"},{"$error":"#N/A"},{"$error":"#N/A"},{"$error":"#N/A"},{"$error":"#N/A"},{"$error":"#N/A"},{"$error":"#N/A"},{"$error":"#N/A"},{"$error":"#N/A"},{"$error":"#N/A"},{"$error":"#N/A"},{"$error":"#N/A"},{"$error":"#N/A"},{"$error":"#N/A"},{"$error":"#N/A"},{"$error":"#N/A"},{"$error":"#N/A"},{"$error":"#N/A"},{"$error":"#N/A"},{"$error":"#N/A"},{"$error":"#N/A"},{"$error":"#N/A"},{"$error":"#N/A"},{"$error":"#N/A"},{"$error":"#N/A"},2263,1673,1508,1364,1356,1543,1565]
["Payments - Walk-in and Drive-thru",{"$error":"#N/A"},{"$error":"#N/A"},{"$error":"#N/A"},{"$error":"#N/A"},{"$error":"#N/A"},{"$error":"#N/A"},{"$error":"#N/A"},{"$error":"#N/A"},{"$error":"#N/A"},{"$error":"#N/A"},{"$error":"#N/A"},{"$error":"#N/A"},{"$error":"#N/A"},{"$error":"#N/A"},{"$error":"#N/A"},{"$error":"#N/A"},{"$error":"#N/A"},{"$error":"#N/A"},{"$error":"#N/A"},{"$error":"#N/A"},{"$error":"#N/A"},{"$error":"#N/A"},{"$error":"#N/A"},{"$error":"#N/A"},{"$error":"#N/A"},{"$error":"#N/A"},{"$error":"#N/A"},{"$error":"#N/A"},{"$error":"#N/A"},{"$error":"#N/A"},{"$error":"#N/A"},{"$error":"#N/A"},{"$error":"#N/A"},{"$error":"#N/A"},{"$error":"#N/A"},{"$error":"#N/A"},7222,7576,7119,7182,6892,7324,8067]
["Payments - Webpay",{"$error":"#N/A"},{"$error":"#N/A"},{"$error":"#N/A"},{"$error":"#N/A"},{"$error":"#N/A"},{"$error":"#N/A"},{"$error":"#N/A"},{"$error":"#N/A"},{"$error":"#N/A"},{"$error":"#N/A"},{"$error":"#N/A"},{"$error":"#N/A"},{"$error":"#N/A"},{"$error":"#N/A"},{"$error":"#N/A"},{"$error":"#N/A"},{"$error":"#N/A"},{"$error":"#N/A"},{"$error":"#N/A"},{"$error":"#N/A"},{"$error":"#N/A"},{"$error":"#N/A"},{"$error":"#N/A"},{"$error":"#N/A"},{"$error":"#N/A"},{"$error":"#N/A"},{"$error":"#N/A"},{"$error":"#N/A"},{"$error":"#N/A"},{"$error":"#N/A"},{"$error":"#N/A"},{"$error":"#N/A"},2056,1904,2028,1389,2104,1943,2057,1866,2085,2281,2039]
["Payments - Bank Bill Pay",{"$error":"#N/A"},{"$error":"#N/A"},{"$error":"#N/A"},{"$error":"#N/A"},{"$error":"#N/A"},{"$error":"#N/A"},{"$error":"#N/A"},{"$error":"#N/A"},{"$error":"#N/A"},{"$error":"#N/A"},{"$error":"#N/A"},{"$error":"#N/A"},{"$error":"#N/A"},{"$error":"#N/A"},{"$error":"#N/A"},{"$error":"#N/A"},{"$error":"#N/A"},{"$error":"#N/A"},{"$error":"#N/A"},{"$error":"#N/A"},{"$error":"#N/A"},{"$error":"#N/A"},{"$error":"#N/A"},{"$error":"#N/A"},{"$error":"#N/A"},{"$error":"#N/A"},{"$error":"#N/A"},{"$error":"#N/A"},{"$error":"#N/A"},{"$error":"#N/A"},{"$error":"#N/A"},{"$error":"#N/A"},{"$error":"#N/A"},{"$error":"#N/A"},{"$error":"#N/A"},{"$error":"#N/A"},1262,1431,1200,1283,1428,1323,1209]
["Payments - Drop Box (after hours)",{"$error":"#N/A"},{"$error":"#N/A"},{"$error":"#N/A"},{"$error":"#N/A"},{"$error":"#N/A"},{"$error":"#N/A"},{"$error":"#N/A"},{"$error":"#N/A"},{"$error":"#N/A"},{"$error":"#N/A"},{"$error":"#N/A"},{"$error":"#N/A"},{"$error":"#N/A"},{"$error":"#N/A"},{"$error":"#N/A"},{"$error":"#N/A"},{"$error":"#N/A"},{"$error":"#N/A"},{"$error":"#N/A"},{"$error":"#N/A"},{"$error":"#N/A"},{"$error":"#N/A"},{"$error":"#N/A"},{"$error":"#N/A"},{"$error":"#N/A"},{"$error":"#N/A"},{"$error":"#N/A"},{"$error":"#N/A"},{"$error":"#N/A"},{"$error":"#N/A"},{"$error":"#N/A"},{"$error":"#N/A"},{"$error":"#N/A"},{"$error":"#N/A"},{"$error":"#N/A"},{"$error":"#N/A"},801,1175,812,1137,1219,1033,1211]
["Payments - Mail",{"$error":"#N/A"},{"$error":"#N/A"},{"$error":"#N/A"},{"$error":"#N/A"},{"$error":"#N/A"},{"$error":"#N/A"},{"$error":"#N/A"},{"$error":"#N/A"},{"$error":"#N/A"},{"$error":"#N/A"},{"$error":"#N/A"},{"$error":"#N/A"},{"$error":"#N/A"},{"$error":"#N/A"},{"$error":"#N/A"},{"$error":"#N/A"},{"$error":"#N/A"},{"$error":"#N/A"},{"$error":"#N/A"},{"$error":"#N/A"},{"$error":"#N/A"},{"$error":"#N/A"},{"$error":"#N/A"},{"$error":"#N/A"},{"$error":"#N/A"},{"$error":"#N/A"},{"$error":"#N/A"},{"$error":"#N/A"},{"$error":"#N/A"},{"$error":"#N/A"},{"$error":"#N/A"},{"$error":"#N/A"},{"$error":"#N/A"},{"$error":"#N/A"},{"$error":"#N/A"},{"$error":"#N/A"},3401,3802,3883,3613,3581,3973,3647]
["Payments - Wired Cash",{"$error":"#N/A"},{"$error":"#N/A"},{"$error":"#N/A"},{"$error":"#N/A"},{"$error":"#N/A"},{"$error":"#N/A"},{"$error":"#N/A"},{"$error":"#N/A"},{"$error":"#N/A"},{"$error":"#N/A"},{"$error":"#N/A"},{"$error":"#N/A"},{"$error":"#N/A"},{"$error":"#N/A"},{"$error":"#N/A"},{"$error":"#N/A"},{"$error":"#N/A"},{"$error":"#N/A"},{"$error":"#N/A"},{"$error":"#N/A"},{"$error":"#N/A"},{"$error":"#N/A"},{"$error":"#N/A"},{"$error":"#N/A"},{"$error":"#N/A"},{"$error":"#N/A"},{"$error":"#N/A"},{"$error":"#N/A"},{"$error":"#N/A"},{"$error":"#N/A"},{"$error":"#N/A"},{"$error":"#N/A"},{"$error":"#N/A"},{"$error":"#N/A"},{"$error":"#N/A"},{"$error":"#N/A"},37,18,35,30,29,42,31]
["Payments - Auto Bank Draft",{"$error":"#N/A"},{"$error":"#N/A"},{"$error":"#N/A"},{"$error":"#N/A"},{"$error":"#N/A"},{"$error":"#N/A"},{"$error":"#N/A"},{"$error":"#N/A"},{"$error":"#N/A"},{"$error":"#N/A"},{"$error":"#N/A"},{"$error":"#N/A"},{"$error":"#N/A"},{"$error":"#N/A"},{"$error":"#N/A"},{"$error":"#N/A"},{"$error":"#N/A"},{"$error":"#N/A"},{"$error":"#N/A"},{"$error":"#N/A"},{"$error":"#N/A"},{"$error":"#N/A"},{"$error":"#N/A"},{"$error":"#N/A"},{"$error":"#N/A"},{"$error":"#N/A"},{"$error":"#N/A"},{"$error":"#N/A"},{"$error":"#N/A"},{"$error":"#N/A"},{"$error":"#N/A"},{"$error":"#N/A"},{"$error":"#N/A"},{"$error":"#N/A"},{"$error":"#N/A"},{"$error":"#N/A"},604,878,885,946,720,880,882]
["Billing Errors",{"$error":"#N/A"},{"$error":"#N/A"},{"$error":"#N/A"},{"$error":"#N/A"},{"$error":"#N/A"},{"$error":"#N/A"},{"$error":"#N/A"},{"$error":"#N/A"},{"$error":"#N/A"},{"$error":"#N/A"},{"$error":"#N/A"},{"$error":"#N/A"},{"$error":"#N/A"},{"$error":"#N/A"},{"$error":"#N/A"},{"$error":"#N/A"},{"$error":"#N/A"},{"$error":"#N/A"},8,10,11,4,2,3,3,3,0,0,0,0,0,0,0,0,0,0,0,4,10,4,5,14,9]
["Cash Drawer Over-Under",{"$error":"#N/A"},{"$error":"#N/A"},{"$error":"#N/A"},{"$error":"#N/A"},{"$error":"#N/A"},{"$error":"#N/A"},{"$error":"#N/A"},{"$error":"#N/A"},{"$error":"#N/A"},{"$error":"#N/A"},{"$error":"#N/A"},{"$error":"#N/A"},{"$error":"#N/A"},{"$error":"#N/A"},{"$error":"#N/A"},{"$error":"#N/A"},{"$error":"#N/A"},{"$error":"#N/A"},-42.12,-79,-19.059999999999999,-42.47,0,-44,64.81,-80.239999999999995,-55.14,0,0,18.86,-40.11,60,-59.57,26,-2.25,1.95,-16.579999999999998,-45.45,0,15.94,-7.87,0,33]
["Service Disconnections (Transactions)",{"$error":"#N/A"},{"$error":"#N/A"},{"$error":"#N/A"},{"$error":"#N/A"},{"$error":"#N/A"},{"$error":"#N/A"},{"$error":"#N/A"},{"$error":"#N/A"},{"$error":"#N/A"},{"$error":"#N/A"},{"$error":"#N/A"},{"$error":"#N/A"},{"$error":"#N/A"},{"$error":"#N/A"},{"$error":"#N/A"},{"$error":"#N/A"},{"$error":"#N/A"},{"$error":"#N/A"},{"$error":"#N/A"},{"$error":"#N/A"},{"$error":"#N/A"},{"$error":"#N/A"},{"$error":"#N/A"},{"$error":"#N/A"},{"$error":"#N/A"},{"$error":"#N/A"},{"$error":"#N/A"},{"$error":"#N/A"},{"$error":"#N/A"},{"$error":"#N/A"},{"$error":"#N/A"},{"$error":"#N/A"},329,293,289,324,276,437,289,218,301,324,289]
["Service Connections (Transactions)",{"$error":"#N/A"},{"$error":"#N/A"},{"$error":"#N/A"},{"$error":"#N/A"},{"$error":"#N/A"},{"$error":"#N/A"},{"$error":"#N/A"},{"$error":"#N/A"},{"$error":"#N/A"},{"$error":"#N/A"},{"$error":"#N/A"},{"$error":"#N/A"},{"$error":"#N/A"},{"$error":"#N/A"},{"$error":"#N/A"},{"$error":"#N/A"},{"$error":"#N/A"},{"$error":"#N/A"},{"$error":"#N/A"},{"$error":"#N/A"},{"$error":"#N/A"},{"$error":"#N/A"},{"$error":"#N/A"},{"$error":"#N/A"},{"$error":"#N/A"},{"$error":"#N/A"},{"$error":"#N/A"},{"$error":"#N/A"},{"$error":"#N/A"},{"$error":"#N/A"},{"$error":"#N/A"},{"$error":"#N/A"},731,566,513,509,566,561,483,533,461,474,401]
[]
[]
[]
[]
[]
[]
[]
[]
[]
["HIGHLIGHTS","2008-07-01","2008-08-01","2008-09-01","2008-10-01","2008-11-01","2008-12-01","2009-01-01","2009-02-01","2009-03-01","2009-04-01","2009-05-01","2009-06-01","2009-07-01","2009-08-01","2009-09-01","2009-10-01","2009-11-01","2009-12-01","2010-01-01","2010-02-01","2010-03-01","2010-04-01","2010-05-01","2010-06-01","2010-07-01","2010-08-01","2010-09-01","2010-10-01","2010-11-01","2010-12-01","2011-01-01","2011-02-01","2011-03-01","2011-04-01","2011-05-01","2011-06-01","2011-07-01","2011-08-01","2011-09-01","2011-10-01","2011-11-01","2011-12-01","2012-01-01"]
["Highlight 1",null,null,null,null,null,null,null,null,null,null,null,null,null,null,null,null,null,null,null,null,null,null,null,null,null,null,null,null,null,null,null,null,null,null,null,null,null,null,"1.  Repaired drive-thru tube system that had malfunctioned."]
["Highlight 2"]
["Highlight 3"]
["Highlight 4"]
["Highlight 5"]
["Highlight 6"]
["Highlight 7"]
["Highlight 8"]
["Highlights Concaetenation",{"$f":"B28&CHAR(10)&B29&CHAR(10)&B30&CHAR(10)&B31&CHAR(10)&B32&CHAR(10)&B33&CHAR(10)&B34&CHAR(10)&B35","v":"\n\n\n\n\n\n\n"},{"$f":"C28&CHAR(10)&C29&CHAR(10)&C30&CHAR(10)&C31&CHAR(10)&C32&CHAR(10)&C33&CHAR(10)&C34&CHAR(10)&C35","v":"\n\n\n\n\n\n\n"},"\n\n\n\n\n\n\n","\n\n\n\n\n\n\n","\n\n\n\n\n\n\n","\n\n\n\n\n\n\n","\n\n\n\n\n\n\n","\n\n\n\n\n\n\n","\n\n\n\n\n\n\n","\n\n\n\n\n\n\n","\n\n\n\n\n\n\n","\n\n\n\n\n\n\n","\n\n\n\n\n\n\n","\n\n\n\n\n\n\n","\n\n\n\n\n\n\n","\n\n\n\n\n\n\n","\n\n\n\n\n\n\n","\n\n\n\n\n\n\n","\n\n\n\n\n\n\n","\n\n\n\n\n\n\n","\n\n\n\n\n\n\n","\n\n\n\n\n\n\n","\n\n\n\n\n\n\n","\n\n\n\n\n\n\n","\n\n\n\n\n\n\n","\n\n\n\n\n\n\n","\n\n\n\n\n\n\n","\n\n\n\n\n\n\n","\n\n\n\n\n\n\n","\n\n\n\n\n\n\n","\n\n\n\n\n\n\n","\n\n\n\n\n\n\n","\n\n\n\n\n\n\n","\n\n\n\n\n\n\n","\n\n\n\n\n\n\n",{"$f":"AK28&CHAR(10)&CHAR(10)&AK29&CHAR(10)&CHAR(10)&AK30&CHAR(10)&CHAR(10)&AK31&CHAR(10)&CHAR(10)&AK32&CHAR(10)&CHAR(10)&AK33&CHAR(10)&CHAR(10)&AK34&CHAR(10)&CHAR(10)&AK35","v":"\n\n\n\n\n\n\n\n\n\n\n\n\n\n"},{"$f":"AL28&CHAR(10)&CHAR(10)&AL29&CHAR(10)&CHAR(10)&AL30&CHAR(10)&CHAR(10)&AL31&CHAR(10)&CHAR(10)&AL32&CHAR(10)&CHAR(10)&AL33&CHAR(10)&CHAR(10)&AL34&CHAR(10)&CHAR(10)&AL35","v":"\n\n\n\n\n\n\n\n\n\n\n\n\n\n"},{"$f":"AM28&CHAR(10)&CHAR(10)&AM29&CHAR(10)&CHAR(10)&AM30&CHAR(10)&CHAR(10)&AM31&CHAR(10)&CHAR(10)&AM32&CHAR(10)&CHAR(10)&AM33&CHAR(10)&CHAR(10)&AM34&CHAR(10)&CHAR(10)&AM35","v":"\n\n\n\n\n\n\n\n\n\n\n\n\n\n"},{"$f":"AN28&CHAR(10)&CHAR(10)&AN29&CHAR(10)&CHAR(10)&AN30&CHAR(10)&CHAR(10)&AN31&CHAR(10)&CHAR(10)&AN32&CHAR(10)&CHAR(10)&AN33&CHAR(10)&CHAR(10)&AN34&CHAR(10)&CHAR(10)&AN35","v":"1.  Repaired drive-thru tube system that had malfunctioned.\n\n\n\n\n\n\n\n\n\n\n\n\n\n"},{"$f":"AO28&CHAR(10)&CHAR(10)&AO29&CHAR(10)&CHAR(10)&AO30&CHAR(10)&CHAR(10)&AO31&CHAR(10)&CHAR(10)&AO32&CHAR(10)&CHAR(10)&AO33&CHAR(10)&CHAR(10)&AO34&CHAR(10)&CHAR(10)&AO35","v":"\n\n\n\n\n\n\n\n\n\n\n\n\n\n"},{"$f":"AP28&CHAR(10)&CHAR(10)&AP29&CHAR(10)&CHAR(10)&AP30&CHAR(10)&CHAR(10)&AP31&CHAR(10)&CHAR(10)&AP32&CHAR(10)&CHAR(10)&AP33&CHAR(10)&CHAR(10)&AP34&CHAR(10)&CHAR(10)&AP35","v":"\n\n\n\n\n\n\n\n\n\n\n\n\n\n"}]
[]
[]
[]
["Bullet Chart Source","Target","What's Better?","Band 1","Band 2","YTD Type","Max Scale","Actual 1","Actual","Actual 3","Projection 1","Projection 2","Projection 3","First Zone 1","First Zone 2","First Zone 3","Second Zone 1","Second Zone 2","Second Zone 3","Previous X 1","Previous X 2","Previous Y 1","Previous Y 2"]
[{"$f":"A5","v":"Complaints Against Customer Service Reps"},10,"Less",1,1.1499999999999999,"Sum",{"$f":"ROUNDUP((ROUNDUP(MAX(B41,SUM(I41,L41)),-LEN(EVEN(MAX(B41,SUM(I41,L41))))+2)/5),-LEN(EVEN(ROUNDUP(MAX(B41,SUM(I41,L41)),-LEN(EVEN(MAX(B41,SUM(I41,L41))))+2)/5))+1)*5","v":10},0,{"$f":"IF(F41=\"Sum\",SUM(OFFSET(A5,0,YTDBeg,1,YTDWidth)),AVERAGE(OFFSET(A5,0,YTDBeg,1,YTDWidth)))","v":7},0,0,{"$f":"IF(F41=\"Sum\",Projection*(I41/YTDWidth*12-I41),0)","v":0},0,{"$f":"B41*D41","v":10},{"$f":"((I41+L41<=N41)*(N41-(I41+L41)))","v":3},{"$f":"N41","v":10},{"$f":"(E41-D41)*B41","v":1.4999999999999991},{"$f":"((I41+L41<=N41+Q41)*((N41+Q41)-(I41+L41+O41)))","v":1.5},{"$f":"Q41","v":1.4999999999999991},{"$f":"IF(F41=\"Sum\",SUM(OFFSET(A5,0,YTDBeg-12,1,YTDWidth)),AVERAGE(OFFSET(A5,0,YTDBeg-12,1,YTDWidth)))","v":{"$error":"#N/A"}},{"$f":"T41","v":{"$error":"#N/A"}},1,2]
[{"$f":"A6","v":"Pro-Corp Calls (after hours) - Talk Time in Minutes"},20000,"Less",1,1.1499999999999999,"Sum",{"$f":"ROUNDUP((ROUNDUP(MAX(B42,SUM(I42,L42)),-LEN(EVEN(MAX(B42,SUM(I42,L42))))+2)/5),-LEN(EVEN(ROUNDUP(MAX(B42,SUM(I42,L42)),-LEN(EVEN(MAX(B42,SUM(I42,L42))))+2)/5))+1)*5","v":20000},0,11272,0,0,0,0,20000,{"$f":"((I42+L42<=N42)*(N42-(I42+L42)))","v":8728},{"$f":"N42","v":20000},2999.9999999999982,{"$f":"((I42+L42<=N42+Q42)*((N42+Q42)-(I42+L42+O42)))","v":3000},{"$f":"Q42","v":2999.9999999999982},{"$error":"#N/A"},{"$f":"T42","v":{"$error":"#N/A"}},1,2]
["Payments - Walk-in and Drive-thru",80000,"Less",1,1.1499999999999999,"Sum",100000,0,51382,0,0,0,0,80000,28618,80000,11999.999999999993,12000,11999.999999999993,{"$error":"#N/A"},{"$error":"#N/A"},1,2]
["Payments - Webpay",23000,"More",0.85,1,"Sum",25000,0,14375,0,0,0,0,19550,5175,19550,3450.0000000000005,3450,3450.0000000000005,{"$error":"#N/A"},{"$error":"#N/A"},1,2]
["Payments - Bank Bill Pay",16000,"More",1,1.1499999999999999,"Sum",20000,0,9136,0,0,0,0,16000,6864,16000,2399.9999999999986,2400,2399.9999999999986,{"$error":"#N/A"},{"$error":"#N/A"},1,2]
["Payments - Drop Box (after hours)",35000,"More",1,1.1499999999999999,"Sum",35000,0,7388,0,0,0,0,35000,27612,35000,5249.9999999999973,5250,5249.9999999999973,{"$error":"#N/A"},{"$error":"#N/A"},1,2]
["Payments - Mail",25000,"More",1,1.1499999999999999,"Sum",30000,0,25900,0,0,0,0,25000,0,25000,3749.9999999999977,2849.9999999999964,3749.9999999999977,{"$error":"#N/A"},{"$error":"#N/A"},1,2]
["Payments - Wired Cash",200,"Less",0.85,1,"Sum",250,0,222,0,0,0,0,170,0,170,30.000000000000004,0,30.000000000000004,{"$error":"#N/A"},{"$error":"#N/A"},1,2]
["Payments - Auto Bank Draft",12000,"More",0.85,1,"Sum",15000,0,5795,0,0,0,0,10200,4405,10200,1800.0000000000002,1800,1800.0000000000002,{"$error":"#N/A"},{"$error":"#N/A"},1,2]
["Billing Errors",40,"Less",1,1.1499999999999999,"Sum",50,0,46,0,0,0,0,40,0,40,5.9999999999999964,0,5.9999999999999964,6,6,1,2]
["Cash Drawer Over-Under",-100,"Middle",0.85,1.1499999999999999,"Sum",-50,0,-20.96,0,0,0,0,-85,0,-85,-29.999999999999993,0,-29.999999999999993,-91.82,-91.82,1,2]
["Service Disconnections (Transactions)",5000,"Less",1,1.1499999999999999,"Sum",5000,0,2134,0,0,0,0,5000,2866,5000,749.99999999999955,750,749.99999999999955,{"$error":"#N/A"},{"$error":"#N/A"},1,2]
["Service Connections (Transactions)",5200,"More",0.85,1,"Sum",{"$f":"ROUNDUP((ROUNDUP(MAX(B53,SUM(I53,L53)),-LEN(EVEN(MAX(B53,SUM(I53,L53))))+2)/5),-LEN(EVEN(ROUNDUP(MAX(B53,SUM(I53,L53)),-LEN(EVEN(MAX(B53,SUM(I53,L53))))+2)/5))+1)*5","v":10000},0,{"$f":"IF(F53=\"Sum\",SUM(OFFSET(A17,0,YTDBeg,1,YTDWidth)),AVERAGE(OFFSET(A17,0,YTDBeg,1,YTDWidth)))","v":3479},0,0,{"$f":"IF(F53=\"Sum\",Projection*(I53/YTDWidth*12-I53),0)","v":0},0,{"$f":"B53*D53","v":4420},{"$f":"((I53+L53<=N53)*(N53-(I53+L53)))","v":941},{"$f":"N53","v":4420},{"$f":"(E53-D53)*B53","v":780.00000000000011},{"$f":"((I53+L53<=N53+Q53)*((N53+Q53)-(I53+L53+O53)))","v":780},{"$f":"Q53","v":780.00000000000011},{"$f":"IF(F53=\"Sum\",SUM(OFFSET(A17,0,YTDBeg-12,1,YTDWidth)),AVERAGE(OFFSET(A17,0,YTDBeg-12,1,YTDWidth)))","v":{"$error":"#N/A"}},{"$f":"T53","v":{"$error":"#N/A"}},1,2]
[]
[]
[]
[]
[]
[]
[]
[]
[]
[]
[]
["SPARKLINE SOURCE"]
[null,11,10,9,8,7,6,5,4,3,2,1,0]
["Measure",{"$f":"OFFSET($A4,0,CurrentMonthCount-B$66,1,1)","v":"2011-02-01"},"2011-03-01","2011-04-01","2011-05-01","2011-06-01","2011-07-01","2011-08-01","2011-09-01","2011-10-01","2011-11-01","2011-12-01","2012-01-01"]
[{"$f":"A5","v":"Complaints Against Customer Service Reps"},{"$f":"OFFSET($A5,0,CurrentMonthCount-B$66,1,1)","v":{"$error":"#N/A"}},{"$error":"#N/A"},{"$error":"#N/A"},{"$error":"#N/A"},{"$error":"#N/A"},2,1,0,0,1,2,1]
[{"$f":"A6","v":"Pro-Corp Calls (after hours) - Talk Time in Minutes"},{"$f":"OFFSET($A6,0,CurrentMonthCount-B$66,1,1)","v":{"$error":"#N/A"}},{"$error":"#N/A"},{"$error":"#N/A"},{"$error":"#N/A"},{"$error":"#N/A"},2263,1673,1508,1364,1356,1543,1565]
["Payments - Walk-in and Drive-thru",{"$f":"OFFSET($A7,0,CurrentMonthCount-B$66,1,1)","v":{"$error":"#N/A"}},{"$error":"#N/A"},{"$error":"#N/A"},{"$error":"#N/A"},{"$error":"#N/A"},7222,7576,7119,7182,6892,7324,8067]
["Payments - Webpay",{"$f":"OFFSET($A8,0,CurrentMonthCount-B$66,1,1)","v":{"$error":"#N/A"}},2056,1904,2028,1389,2104,1943,2057,1866,2085,2281,2039]
["Payments - Bank Bill Pay",{"$f":"OFFSET($A9,0,CurrentMonthCount-B$66,1,1)","v":{"$error":"#N/A"}},{"$error":"#N/A"},{"$error":"#N/A"},{"$error":"#N/A"},{"$error":"#N/A"},1262,1431,1200,1283,1428,1323,1209]
["Payments - Drop Box (after hours)",{"$f":"OFFSET($A10,0,CurrentMonthCount-B$66,1,1)","v":{"$error":"#N/A"}},{"$error":"#N/A"},{"$error":"#N/A"},{"$error":"#N/A"},{"$error":"#N/A"},801,1175,812,1137,1219,1033,1211]
["Payments - Mail",{"$f":"OFFSET($A11,0,CurrentMonthCount-B$66,1,1)","v":{"$error":"#N/A"}},{"$error":"#N/A"},{"$error":"#N/A"},{"$error":"#N/A"},{"$error":"#N/A"},3401,3802,3883,3613,3581,3973,3647]
["Payments - Wired Cash",{"$f":"OFFSET($A12,0,CurrentMonthCount-B$66,1,1)","v":{"$error":"#N/A"}},{"$error":"#N/A"},{"$error":"#N/A"},{"$error":"#N/A"},{"$error":"#N/A"},37,18,35,30,29,42,31]
["Payments - Auto Bank Draft",{"$f":"OFFSET($A13,0,CurrentMonthCount-B$66,1,1)","v":{"$error":"#N/A"}},{"$error":"#N/A"},{"$error":"#N/A"},{"$error":"#N/A"},{"$error":"#N/A"},604,878,885,946,720,880,882]
["Billing Errors",{"$f":"OFFSET($A14,0,CurrentMonthCount-B$66,1,1)","v":0},0,0,0,0,0,4,10,4,5,14,9]
["Cash Drawer Over-Under",{"$f":"OFFSET($A15,0,CurrentMonthCount-B$66,1,1)","v":60},-59.57,26,-2.25,1.95,-16.579999999999998,-45.45,0,15.94,-7.87,0,33]
["Service Disconnections (Transactions)",{"$f":"OFFSET($A16,0,CurrentMonthCount-B$66,1,1)","v":{"$error":"#N/A"}},329,293,289,324,276,437,289,218,301,324,289]
["Service Connections (Transactions)",{"$f":"OFFSET($A17,0,CurrentMonthCount-B$66,1,1)","v":{"$error":"#N/A"}},731,566,513,509,566,561,483,533,461,474,401]
[0,{"$f":"OFFSET($A18,0,CurrentMonthCount-B$66,1,1)","v":0},0,0,0,0,0,0,0,0,0,0,0]
[0,{"$f":"OFFSET($A19,0,CurrentMonthCount-B$66,1,1)","v":0},0,0,0,0,0,0,0,0,0,0,0]
[0,{"$f":"OFFSET($A20,0,CurrentMonthCount-B$66,1,1)","v":0},0,0,0,0,0,0,0,0,0,0,0]
[0,{"$f":"OFFSET($A21,0,CurrentMonthCount-B$66,1,1)","v":0},0,0,0,0,0,0,0,0,0,0,0]
[0,{"$f":"OFFSET($A22,0,CurrentMonthCount-B$66,1,1)","v":0},0,0,0,0,0,0,0,0,0,0,0]
[0,{"$f":"OFFSET($A23,0,CurrentMonthCount-B$66,1,1)","v":0},0,0,0,0,0,0,0,0,0,0,0]
[0,{"$f":"OFFSET($A24,0,CurrentMonthCount-B$66,1,1)","v":0},0,0,0,0,0,0,0,0,0,0,0]
[]
[]
[]
[]
[]
[]
[]
[]
[]
[]
[]
[]
[]
["Cash Drawer Over/Under",-100,0,100]
[null,{"$f":"IF(I51>0,-100,IF(I51<-100,0,-100-I51))","v":-79.039999999999992},{"$f":"I51","v":-20.96},{"$f":"IF(I51<0,100,IF(I51>100,0,100-I51))","v":100}]
[null,-100,0,100]

{"sheet":"Police","index":7,"n_rows":13,"n_cols":9,"rows_kept":13,"cut":false,"hidden":false,"merged":[]}
[{"$f":"CurrentMonth","v":"2012-01-01"},null,null,null,"POLICE"]
[]
["Crimes","Last 12 Months","Fiscal Year to Date","FYTD",null,"Response","Last 12 Months","Fiscal Year to Date","FYTD"]
[{"$f":"'Police Data'!A5","v":"UCR Part I Violent Crimes"},null,null,{"$f":"'Police Data'!I41","v":38},null,{"$f":"'Police Data'!A9","v":"Incidents Requiring a Response (Police)"},null,null,{"$f":"'Police Data'!I45","v":18045}]
[{"$f":"'Police Data'!A6","v":"UCR Part I Property Crimes"},null,null,{"$f":"'Police Data'!I42","v":688},null,{"$f":"'Police Data'!A10","v":"Bartow 911 Response Time (call entry to dispatch - top priority calls, secs)"},null,null,{"$f":"'Police Data'!I46","v":186.42857142857142}]
[{"$f":"'Police Data'!A7","v":"UCR Part II Drug Offenses"},null,null,{"$f":"'Police Data'!I43","v":103},null,{"$f":"'Police Data'!A11","v":"CPD Response Time (dispatch to arrival - top priority calls, secs)"},null,null,{"$f":"'Police Data'!I47","v":269.42857142857144}]
[{"$f":"'Police Data'!A8","v":"Crime Clearance Rate"},null,null,{"$f":"'Police Data'!I44","v":0.5962142857142857},null,{"$f":"'Police Data'!A12","v":"% of Top Priority Calls with Response Time < 5 Minutes (CPD dispatch to arrival)"},null,null,{"$f":"'Police Data'!I48","v":0.71714285714285708}]
[]
["Traffic",null,null,null,null,"Human Resources"]
[{"$f":"'Police Data'!A13","v":"Traffic Citations Issued (Excluding DUI)"},null,null,{"$f":"'Police Data'!I49","v":2303},null,{"$f":"'Police Data'!A16","v":"Staff Injuries (Police)"},null,null,{"$f":"'Police Data'!I52","v":4}]
[{"$f":"'Police Data'!A14","v":"Traffic Accidents Reported"},null,null,{"$f":"'Police Data'!I50","v":779},null,{"$f":"'Police Data'!A17","v":"Training Hours Received (Police)"},null,null,{"$f":"'Police Data'!I53","v":1794}]
[{"$f":"'Police Data'!A15","v":"DUI Arrests"},null,null,{"$f":"'Police Data'!I51","v":56},null,{"$f":"'Police Data'!A18","v":"Officer Complaints"},null,null,{"$f":"'Police Data'!I54","v":20}]
[null,null,null,null,null,{"$f":"'Police Data'!A19","v":"Officer Complaints Sustained"},null,null,{"$f":"'Police Data'!I55","v":1}]

{"sheet":"Police Data","index":8,"n_rows":87,"n_cols":44,"rows_kept":87,"cut":false,"hidden":false,"merged":[]}
["Police Data"]
[]
[]
["Measure","Jul 08","2008-08-01","2008-09-01","2008-10-01","2008-11-01","2008-12-01","2009-01-01","2009-02-01","2009-03-01","2009-04-01","2009-05-01","2009-06-01","2009-07-01","2009-08-01","2009-09-01","2009-10-01","2009-11-01","2009-12-01","2010-01-01","2010-02-01","2010-03-01","2010-04-01","2010-05-01","2010-06-01","2010-07-01","2010-08-01","2010-09-01","2010-10-01","2010-11-01","2010-12-01","2011-01-01","2011-02-01","2011-03-01","2011-04-01","2011-05-01","2011-06-01","2011-07-01","2011-08-01","2011-09-01","2011-10-01","2011-11-01","2011-12-01","2012-01-01"]
["UCR Part I Violent Crimes",{"$error":"#N/A"},{"$error":"#N/A"},{"$error":"#N/A"},{"$error":"#N/A"},{"$error":"#N/A"},{"$error":"#N/A"},{"$error":"#N/A"},{"$error":"#N/A"},{"$error":"#N/A"},{"$error":"#N/A"},{"$error":"#N/A"},{"$error":"#N/A"},{"$error":"#N/A"},{"$error":"#N/A"},{"$error":"#N/A"},{"$error":"#N/A"},{"$error":"#N/A"},{"$error":"#N/A"},4,3,4,1,2,3,3,5,8,6,3,0,3,6,6,6,8,7,14,4,6,4,7,0,3]
["UCR Part I Property Crimes",{"$error":"#N/A"},{"$error":"#N/A"},{"$error":"#N/A"},{"$error":"#N/A"},{"$error":"#N/A"},{"$error":"#N/A"},{"$error":"#N/A"},{"$error":"#N/A"},{"$error":"#N/A"},{"$error":"#N/A"},{"$error":"#N/A"},{"$error":"#N/A"},{"$error":"#N/A"},{"$error":"#N/A"},{"$error":"#N/A"},{"$error":"#N/A"},{"$error":"#N/A"},{"$error":"#N/A"},94,77,70,76,77,72,80,87,76,77,87,91,63,66,99,85,107,101,106,103,81,115,73,117,93]
["UCR Part II Drug Offenses",{"$error":"#N/A"},{"$error":"#N/A"},{"$error":"#N/A"},{"$error":"#N/A"},{"$error":"#N/A"},{"$error":"#N/A"},{"$error":"#N/A"},{"$error":"#N/A"},{"$error":"#N/A"},{"$error":"#N/A"},{"$error":"#N/A"},{"$error":"#N/A"},{"$error":"#N/A"},{"$error":"#N/A"},{"$error":"#N/A"},{"$error":"#N/A"},{"$error":"#N/A"},{"$error":"#N/A"},13,7,7,13,14,11,12,14,17,11,20,19,22,13,18,21,19,21,13,12,13,14,19,15,17]
["Crime Clearance Rate",{"$error":"#N/A"},{"$error":"#N/A"},{"$error":"#N/A"},{"$error":"#N/A"},{"$error":"#N/A"},{"$error":"#N/A"},{"$error":"#N/A"},{"$error":"#N/A"},{"$error":"#N/A"},{"$error":"#N/A"},{"$error":"#N/A"},{"$error":"#N/A"},{"$error":"#N/A"},{"$error":"#N/A"},{"$error":"#N/A"},{"$error":"#N/A"},{"$error":"#N/A"},{"$error":"#N/A"},0.68,0.5,0.42,0.88,0.64,0.379,0.27,0.35,0.47,0.42,0.50490000000000002,0.3,0.35,0.3,0.65,0.54,0.65,0.47,0.4,0.61,0.82,0.50349999999999995,0.63,0.69,0.52]
["Incidents Requiring a Response (Police)",{"$error":"#N/A"},{"$error":"#N/A"},{"$error":"#N/A"},{"$error":"#N/A"},{"$error":"#N/A"},{"$error":"#N/A"},{"$error":"#N/A"},{"$error":"#N/A"},{"$error":"#N/A"},{"$error":"#N/A"},{"$error":"#N/A"},{"$error":"#N/A"},{"$error":"#N/A"},{"$error":"#N/A"},{"$error":"#N/A"},{"$error":"#N/A"},{"$error":"#N/A"},{"$error":"#N/A"},2000,1969,2016,2161,2574,2503,2521,2348,2360,2880,2551,2432,2671,2405,2508,2526,2550,2493,2573,2414,2368,2769,2791,2745,2385]
["Bartow 911 Response Time (call entry to dispatch - top priority calls, secs)",{"$error":"#N/A"},{"$error":"#N/A"},{"$error":"#N/A"},{"$error":"#N/A"},{"$error":"#N/A"},{"$error":"#N/A"},{"$error":"#N/A"},{"$error":"#N/A"},{"$error":"#N/A"},{"$error":"#N/A"},{"$error":"#N/A"},{"$error":"#N/A"},{"$error":"#N/A"},{"$error":"#N/A"},{"$error":"#N/A"},{"$error":"#N/A"},{"$error":"#N/A"},{"$error":"#N/A"},{"$error":"#N/A"},{"$error":"#N/A"},{"$error":"#N/A"},{"$error":"#N/A"},{"$error":"#N/A"},{"$error":"#N/A"},{"$error":"#N/A"},{"$error":"#N/A"},{"$error":"#N/A"},{"$error":"#N/A"},{"$error":"#N/A"},{"$error":"#N/A"},{"$error":"#N/A"},{"$error":"#N/A"},{"$error":"#N/A"},{"$error":"#N/A"},{"$error":"#N/A"},{"$error":"#N/A"},177,208,205,185,164,185,181]
["CPD Response Time (dispatch to arrival - top priority calls, secs)",{"$error":"#N/A"},{"$error":"#N/A"},{"$error":"#N/A"},{"$error":"#N/A"},{"$error":"#N/A"},{"$error":"#N/A"},{"$error":"#N/A"},{"$error":"#N/A"},{"$error":"#N/A"},{"$error":"#N/A"},{"$error":"#N/A"},{"$error":"#N/A"},{"$error":"#N/A"},{"$error":"#N/A"},{"$error":"#N/A"},{"$error":"#N/A"},{"$error":"#N/A"},{"$error":"#N/A"},{"$error":"#N/A"},{"$error":"#N/A"},{"$error":"#N/A"},{"$error":"#N/A"},{"$error":"#N/A"},{"$error":"#N/A"},{"$error":"#N/A"},{"$error":"#N/A"},{"$error":"#N/A"},{"$error":"#N/A"},{"$error":"#N/A"},{"$error":"#N/A"},{"$error":"#N/A"},{"$error":"#N/A"},{"$error":"#N/A"},{"$error":"#N/A"},{"$error":"#N/A"},{"$error":"#N/A"},294,292,265,244,243,258,290]
["% of Top Priority Calls with Response Time < 5 Minutes (CPD dispatch to arrival)",{"$error":"#N/A"},{"$error":"#N/A"},{"$error":"#N/A"},{"$error":"#N/A"},{"$error":"#N/A"},{"$error":"#N/A"},{"$error":"#N/A"},{"$error":"#N/A"},{"$error":"#N/A"},{"$error":"#N/A"},{"$error":"#N/A"},{"$error":"#N/A"},{"$error":"#N/A"},{"$error":"#N/A"},{"$error":"#N/A"},{"$error":"#N/A"},{"$error":"#N/A"},{"$error":"#N/A"},{"$error":"#N/A"},{"$error":"#N/A"},{"$error":"#N/A"},{"$error":"#N/A"},{"$error":"#N/A"},{"$error":"#N/A"},{"$error":"#N/A"},{"$error":"#N/A"},{"$error":"#N/A"},{"$error":"#N/A"},{"$error":"#N/A"},{"$error":"#N/A"},{"$error":"#N/A"},{"$error":"#N/A"},{"$error":"#N/A"},{"$error":"#N/A"},{"$error":"#N/A"},{"$error":"#N/A"},0.61,0.76,0.72,0.75,0.7,0.75,0.73]
["Traffic Citations Issued (Excluding DUI)",{"$error":"#N/A"},{"$error":"#N/A"},{"$error":"#N/A"},{"$error":"#N/A"},{"$error":"#N/A"},{"$error":"#N/A"},{"$error":"#N/A"},{"$error":"#N/A"},{"$error":"#N/A"},{"$error":"#N/A"},{"$error":"#N/A"},{"$error":"#N/A"},{"$error":"#N/A"},{"$error":"#N/A"},{"$error":"#N/A"},{"$error":"#N/A"},{"$error":"#N/A"},{"$error":"#N/A"},127,320,328,345,517,556,526,519,534,642,552,446,536,418,395,425,408,390,360,258,225,309,454,402,295]
["Traffic Accidents Reported",{"$error":"#N/A"},{"$error":"#N/A"},{"$error":"#N/A"},{"$error":"#N/A"},{"$error":"#N/A"},{"$error":"#N/A"},{"$error":"#N/A"},{"$error":"#N/A"},{"$error":"#N/A"},{"$error":"#N/A"},{"$error":"#N/A"},{"$error":"#N/A"},{"$error":"#N/A"},{"$error":"#N/A"},{"$error":"#N/A"},{"$error":"#N/A"},{"$error":"#N/A"},{"$error":"#N/A"},142,107,114,140,122,110,114,123,119,116,115,116,103,105,134,103,93,126,102,129,110,100,115,115,108]
["DUI Arrests",{"$error":"#N/A"},{"$error":"#N/A"},{"$error":"#N/A"},{"$error":"#N/A"},{"$error":"#N/A"},{"$error":"#N/A"},{"$error":"#N/A"},{"$error":"#N/A"},{"$error":"#N/A"},{"$error":"#N/A"},{"$error":"#N/A"},{"$error":"#N/A"},{"$error":"#N/A"},{"$error":"#N/A"},{"$error":"#N/A"},{"$error":"#N/A"},{"$error":"#N/A"},{"$error":"#N/A"},4,6,13,4,2,3,14,12,8,11,10,9,5,13,8,9,8,7,14,9,4,6,12,6,5]
["Staff Injuries (Police)",{"$error":"#N/A"},{"$error":"#N/A"},{"$error":"#N/A"},{"$error":"#N/A"},{"$error":"#N/A"},{"$error":"#N/A"},{"$error":"#N/A"},{"$error":"#N/A"},{"$error":"#N/A"},{"$error":"#N/A"},{"$error":"#N/A"},{"$error":"#N/A"},{"$error":"#N/A"},{"$error":"#N/A"},{"$error":"#N/A"},{"$error":"#N/A"},{"$error":"#N/A"},{"$error":"#N/A"},0,1,0,0,0,0,2,0,3,0,1,2,2,1,0,0,0,0,3,0,0,0,0,1,0]
["Training Hours Received (Police)",{"$error":"#N/A"},{"$error":"#N/A"},{"$error":"#N/A"},{"$error":"#N/A"},{"$error":"#N/A"},{"$error":"#N/A"},{"$error":"#N/A"},{"$error":"#N/A"},{"$error":"#N/A"},{"$error":"#N/A"},{"$error":"#N/A"},{"$error":"#N/A"},{"$error":"#N/A"},{"$error":"#N/A"},{"$error":"#N/A"},{"$error":"#N/A"},{"$error":"#N/A"},{"$error":"#N/A"},{"$error":"#N/A"},{"$error":"#N/A"},{"$error":"#N/A"},{"$error":"#N/A"},{"$error":"#N/A"},{"$error":"#N/A"},{"$error":"#N/A"},{"$error":"#N/A"},{"$error":"#N/A"},{"$error":"#N/A"},{"$error":"#N/A"},{"$error":"#N/A"},{"$error":"#N/A"},{"$error":"#N/A"},{"$error":"#N/A"},{"$error":"#N/A"},{"$error":"#N/A"},256,126,387,200,532,160,176,213]
["Officer Complaints",{"$error":"#N/A"},{"$error":"#N/A"},{"$error":"#N/A"},{"$error":"#N/A"},{"$error":"#N/A"},{"$error":"#N/A"},{"$error":"#N/A"},{"$error":"#N/A"},{"$error":"#N/A"},{"$error":"#N/A"},{"$error":"#N/A"},{"$error":"#N/A"},{"$error":"#N/A"},{"$error":"#N/A"},{"$error":"#N/A"},{"$error":"#N/A"},{"$error":"#N/A"},{"$error":"#N/A"},4,7,5,1,2,2,0,7,7,1,2,7,4,3,7,30,13,4,4,2,0,1,2,4,7]
["Officer Complaints Sustained",{"$error":"#N/A"},{"$error":"#N/A"},{"$error":"#N/A"},{"$error":"#N/A"},{"$error":"#N/A"},{"$error":"#N/A"},{"$error":"#N/A"},{"$error":"#N/A"},{"$error":"#N/A"},{"$error":"#N/A"},{"$error":"#N/A"},{"$error":"#N/A"},{"$error":"#N/A"},{"$error":"#N/A"},{"$error":"#N/A"},{"$error":"#N/A"},{"$error":"#N/A"},{"$error":"#N/A"},{"$error":"#N/A"},{"$error":"#N/A"},{"$error":"#N/A"},{"$error":"#N/A"},{"$error":"#N/A"},{"$error":"#N/A"},{"$error":"#N/A"},{"$error":"#N/A"},{"$error":"#N/A"},{"$error":"#N/A"},{"$error":"#N/A"},{"$error":"#N/A"},{"$error":"#N/A"},{"$error":"#N/A"},{"$error":"#N/A"},{"$error":"#N/A"},{"$error":"#N/A"},{"$error":"#N/A"},0,0,0,0,0,0,1]
[]
[]
[]
[]
[]
[]
[]
["HIGHLIGHTS","Jul 08","2008-08-01","2008-09-01","2008-10-01","2008-11-01","2008-12-01","2009-01-01","2009-02-01","2009-03-01","2009-04-01","2009-05-01","2009-06-01","2009-07-01","2009-08-01","2009-09-01","2009-10-01","2009-11-01","2009-12-01","2010-01-01","2010-02-01","2010-03-01","2010-04-01","2010-05-01","2010-06-01","2010-07-01","2010-08-01","2010-09-01","2010-10-01","2010-11-01","2010-12-01","2011-01-01","2011-02-01","2011-03-01","2011-04-01","2011-05-01","2011-06-01","2011-07-01","2011-08-01","2011-09-01","2011-10-01","2011-11-01","2011-12-01","2012-01-01"]
["Highlight 1",null,null,null,null,null,null,null,null,null,null,null,null,null,null,null,null,null,null,null,null,null,null,null,null,null,null,null,null,null,null,null,null,null,null,null,null,"1.  There was an abnormally high number of UCR Part I violent crimes in July, including 8 incidents of sexual assult.",null,"1.  Reported crime rates are higher than last year.  We speculate that this increase in crime may be related to the struggling economy.","A presentation was conducted for the Chamber of Commerce on shoplifting prevention","The Cartersville Police Department stepped up efforts to promote safe driving during the Thanksgiving holiday period.  Efforts included increased traffic enforcement to curb speeding, as well as four sobriety check points to protect citizens from intoxicated motorists.","Participated in \"Bell Ringing\" campaign for the  Salvation Army.","Hired Tawanda Hill in Administrative Services"]
["Highlight 2",null,null,null,null,null,null,null,null,null,null,null,null,null,null,null,null,null,null,null,null,null,null,null,null,null,null,null,null,null,null,null,null,null,null,null,null,null,null,"2.  The current crime clearance rate is exceeding our goal.","Participated in the 3rd annual \"Pill Take\" Collected 43 lbs. of assorted drugs","Participated in the \"Bell Ringing\" campaign during the Thanksgiving holiday for the  Salvation Army.","Concentrated traffic enforcement (Speeding) ","Submitted Pill Mill Ordinance to City Council"]
["Highlight 3",null,null,null,null,null,null,null,null,null,null,null,null,null,null,null,null,null,null,null,null,null,null,null,null,null,null,null,null,null,null,null,null,null,null,null,null,null,null,null,"Broke ground on new Public Safety Facility","Progress continues to be made on the construction of the new Public Safety Headquarters.","Used \"Bait Car\" in Cherokee Place to apprehend entering auto perpotrators ","Reestablished department Honor Guard"]
["Highlight 4",null,null,null,null,null,null,null,null,null,null,null,null,null,null,null,null,null,null,null,null,null,null,null,null,null,null,null,null,null,null,null,null,null,null,null,null,null,null,null,"GACP confirmed our State Certification Renewal","One new officer graduated from the Police Academy.","Juan Mesa graduated from North Central Police Academy","Hosted Emergency Response Council Meeting and Breakfast"]
["Highlight 5",null,null,null,null,null,null,null,null,null,null,null,null,null,null,null,null,null,null,null,null,null,null,null,null,null,null,null,null,null,null,null,null,null,null,null,null,null,null,null,"Established a new Neighborhood Watch on North Erwin Street","Three CPD officers obtained advanced certification."]
["Highlight 6",null,null,null,null,null,null,null,null,null,null,null,null,null,null,null,null,null,null,null,null,null,null,null,null,null,null,null,null,null,null,null,null,null,null,null,null,null,null,null,"Bank Robbery Suspect apprehended in less than 30 minutes after crime","The CPD received its third consecutive State Certification.  The CPD has been state certified for the past 11 years, certifying every 5 years. "]
["Highlight 7",null,null,null,null,null,null,null,null,null,null,null,null,null,null,null,null,null,null,null,null,null,null,null,null,null,null,null,null,null,null,null,null,null,null,null,null,null,null,null,"21 cases cleared by CID","Construction of the new Public Safety Headquarters is progressing on schedule.  All infrastructure is in place, and the old gas line running through the property has been relocated.  Footings for the structure are now 90% complete."]
["Highlight 8",null,null,null,null,null,null,null,null,null,null,null,null,null,null,null,null,null,null,null,null,null,null,null,null,null,null,null,null,null,null,null,null,null,null,null,null,null,null,null,"Total departmental training hours was 532"]
["Highlights Concaetenation",{"$f":"B28&CHAR(10)&B29&CHAR(10)&B30&CHAR(10)&B31&CHAR(10)&B32&CHAR(10)&B33&CHAR(10)&B34&CHAR(10)&B35","v":"\n\n\n\n\n\n\n"},{"$f":"C28&CHAR(10)&C29&CHAR(10)&C30&CHAR(10)&C31&CHAR(10)&C32&CHAR(10)&C33&CHAR(10)&C34&CHAR(10)&C35","v":"\n\n\n\n\n\n\n"},"\n\n\n\n\n\n\n","\n\n\n\n\n\n\n","\n\n\n\n\n\n\n","\n\n\n\n\n\n\n","\n\n\n\n\n\n\n","\n\n\n\n\n\n\n","\n\n\n\n\n\n\n","\n\n\n\n\n\n\n","\n\n\n\n\n\n\n","\n\n\n\n\n\n\n","\n\n\n\n\n\n\n","\n\n\n\n\n\n\n","\n\n\n\n\n\n\n","\n\n\n\n\n\n\n","\n\n\n\n\n\n\n","\n\n\n\n\n\n\n","\n\n\n\n\n\n\n","\n\n\n\n\n\n\n","\n\n\n\n\n\n\n","\n\n\n\n\n\n\n","\n\n\n\n\n\n\n","\n\n\n\n\n\n\n","\n\n\n\n\n\n\n","\n\n\n\n\n\n\n","\n\n\n\n\n\n\n","\n\n\n\n\n\n\n","\n\n\n\n\n\n\n","\n\n\n\n\n\n\n","\n\n\n\n\n\n\n","\n\n\n\n\n\n\n","\n\n\n\n\n\n\n","\n\n\n\n\n\n\n","\n\n\n\n\n\n\n",{"$f":"AK28&CHAR(10)&CHAR(10)&AK29&CHAR(10)&CHAR(10)&AK30&CHAR(10)&CHAR(10)&AK31&CHAR(10)&CHAR(10)&AK32&CHAR(10)&CHAR(10)&AK33&CHAR(10)&CHAR(10)&AK34&CHAR(10)&CHAR(10)&AK35","v":"\n\n\n\n\n\n\n\n\n\n\n\n\n\n"},"1.  There was an abnormally high number of UCR Part I violent crimes in July, including 8 incidents of sexual assult.\n\n\n\n\n\n\n\n\n\n\n\n\n\n","\n\n\n\n\n\n\n\n\n\n\n\n\n\n","1.  Reported crime rates are higher than last year.  We speculate that this increase in crime may be related to the struggling economy.\n\n2.  The current crime clearance rate is exceeding our goal.\n\n\n\n\n\n\n\n\n\n\n\n","A presentation was conducted for the Chamber of Commerce on shoplifting prevention\n\nParticipated in the 3rd annual \"Pill Take\" Collected 43 lbs. of assorted drugs\n\nBroke ground on new Public Safety Facility\n\nGACP confirmed our State Certification Renewal\n\nEstablished a new Neighborhood Watch on North Erwin Street\n\nBank Robbery Suspect apprehended in less than 30 minutes after crime\n\n21 cases cleared by CID\n\nTotal departmental training hours was 532","The Cartersville Police Department stepped up efforts to promote safe driving during the Thanksgiving holiday period.  Efforts included increased traffic enforcement to curb speeding, as well as four sobriety check points to protect citizens from intoxicated motorists.\n\nParticipated in the \"Bell Ringing\" campaign during the Thanksgiving holiday for the  Salvation Army.\n\nProgress continues to be made on the construction of the new Public Safety Headquarters.\n\nOne new officer graduated from the Police Academy.\n\nThree CPD officers obtained advanced certification.\n\nThe CPD received its third consecutive State Certification.  The CPD has been state certified for the past 11 years, certifying every 5 years. \n\nConstruction of the new Public Safety Headquarters is progressing on schedule.  All infrastructure is in place, and the old gas line running through the property has been relocated.  Footings for the structure are now 90% complete.\n\n","Participated in \"Bell Ringing\" campaign for the  Salvation Army.\n\nConcentrated traffic enforcement (Speeding) \n\nUsed \"Bait Car\" in Cherokee Place to apprehend entering auto perpotrators \n\nJuan Mesa graduated from North Central Police Academy\n\n\n\n\n\n\n\n","Hired Tawanda Hill in Administrative Services\n\nSubmitted Pill Mill Ordinance to City Council\n\nReestablished department Honor Guard\n\nHosted Emergency Response Council Meeting and Breakfast\n\n\n\n\n\n\n\n"]
[]
[]
[]
["Bullet Chart Source","Target","What's Better?","Band 1","Band 2","YTD Type","Max Scale","Actual 1","Actual","Actual 3","Projection 1","Projection 2","Projection 3","First Zone 1","First Zone 2","First Zone 3","Second Zone 1","Second Zone 2","Second Zone 3","Previous X 1","Previous X 2","Previous Y 1","Previous Y 2"]
[{"$f":"A5","v":"UCR Part I Violent Crimes"},42,"Less",1,1.1499999999999999,"Sum",{"$f":"ROUNDUP((ROUNDUP(MAX(B41,SUM(I41,L41)),-LEN(EVEN(MAX(B41,SUM(I41,L41))))+2)/5),-LEN(EVEN(ROUNDUP(MAX(B41,SUM(I41,L41)),-LEN(EVEN(MAX(B41,SUM(I41,L41))))+2)/5))+1)*5","v":50},0,{"$f":"IF(F41=\"Sum\",SUM(OFFSET(A5,0,YTDBeg,1,YTDWidth)),AVERAGE(OFFSET(A5,0,YTDBeg,1,YTDWidth)))","v":38},0,0,{"$f":"IF(F41=\"Sum\",Projection*(I41/YTDWidth*12-I41),0)","v":0},0,{"$f":"B41*D41","v":42},{"$f":"((I41+L41<=N41)*(N41-(I41+L41)))","v":4},{"$f":"N41","v":42},{"$f":"(E41-D41)*B41","v":6.2999999999999963},{"$f":"((I41+L41<=N41+Q41)*((N41+Q41)-(I41+L41+O41)))","v":6.2999999999999972},{"$f":"Q41","v":6.2999999999999963},{"$f":"IF(F41=\"Sum\",SUM(OFFSET(A5,0,YTDBeg-12,1,YTDWidth)),AVERAGE(OFFSET(A5,0,YTDBeg-12,1,YTDWidth)))","v":28},{"$f":"T41","v":28},1,2]
[{"$f":"A6","v":"UCR Part I Property Crimes"},964,"Less",1,1.1499999999999999,"Sum",{"$f":"ROUNDUP((ROUNDUP(MAX(B42,SUM(I42,L42)),-LEN(EVEN(MAX(B42,SUM(I42,L42))))+2)/5),-LEN(EVEN(ROUNDUP(MAX(B42,SUM(I42,L42)),-LEN(EVEN(MAX(B42,SUM(I42,L42))))+2)/5))+1)*5","v":1000},0,688,0,0,0,0,964,{"$f":"((I42+L42<=N42)*(N42-(I42+L42)))","v":276},{"$f":"N42","v":964},144.59999999999991,{"$f":"((I42+L42<=N42+Q42)*((N42+Q42)-(I42+L42+O42)))","v":144.59999999999991},{"$f":"Q42","v":144.59999999999991},561,{"$f":"T42","v":561},1,2]
["UCR Part II Drug Offenses",158,"Less",1,1.1499999999999999,"Sum",200,0,103,0,0,0,0,158,55,158,23.699999999999985,23.699999999999989,23.699999999999985,115,115,1,2]
["Crime Clearance Rate",0.48,"More",0.85,1,"Average",1,0,0.5962142857142857,0,0,0,0,0.40799999999999997,0,0.40799999999999997,7.2000000000000008E-2,0,7.2000000000000008E-2,0.38069999999999998,0.38069999999999998,1,2]
["Incidents Requiring a Response (Police)",28315,"Less",1,1.1499999999999999,"Sum",30000,0,18045,0,0,0,0,28315,10270,28315,4247.2499999999973,4247.2499999999964,4247.2499999999973,17763,17763,1,2]
["Bartow 911 Response Time (call entry to dispatch - top priority calls, secs)",191,"Less",1,1.1499999999999999,"Average",200,0,186.42857142857142,0,0,0,0,191,4.5714285714285836,191,28.649999999999984,28.649999999999977,28.649999999999984,{"$error":"#N/A"},{"$error":"#N/A"},1,2]
["CPD Response Time (dispatch to arrival - top priority calls, secs)",258,"Less",1,1.1499999999999999,"Average",300,0,269.42857142857144,0,0,0,0,258,0,258,38.699999999999974,27.271428571428544,38.699999999999974,{"$error":"#N/A"},{"$error":"#N/A"},1,2]
["% of Top Priority Calls with Response Time < 5 Minutes (CPD dispatch to arrival)",0.65500000000000003,"More",0.85,1,"Average",1,0,0.71714285714285708,0,0,0,0,0.55674999999999997,0,0.55674999999999997,9.8250000000000018E-2,0,9.8250000000000018E-2,{"$error":"#N/A"},{"$error":"#N/A"},1,2]
["Traffic Citations Issued (Excluding DUI)",5412,"Middle",0.93,1.07,"Sum",10000,0,2303,0,0,0,0,5033.16,2730.16,5033.16,757.68000000000006,757.68000000000029,757.68000000000006,3755,3755,1,2]
["Traffic Accidents Reported",1438,"Less",1,1.1499999999999999,"Sum",1500,0,779,0,0,0,0,1438,659,1438,215.69999999999987,215.69999999999982,215.69999999999987,806,806,1,2]
["DUI Arrests",96,"Less",1,1.1499999999999999,"Sum",100,0,56,0,0,0,0,96,40,96,14.399999999999991,14.399999999999991,14.399999999999991,69,69,1,2]
["Staff Injuries (Police)",8,"Less",1,1.1499999999999999,"Sum",10,0,4,0,0,0,0,8,4,8,1.1999999999999993,1.1999999999999993,1.1999999999999993,10,10,1,2]
["Training Hours Received (Police)",4183,"Middle",0.93,1.07,"Sum",4500,0,1794,0,0,0,0,3890.19,2096.19,3890.19,585.62,585.62000000000035,585.62,{"$error":"#N/A"},{"$error":"#N/A"},1,2]
["Officer Complaints",55,"Less",1,1.1499999999999999,"Sum",100,0,20,0,0,0,0,55,35,55,8.2499999999999947,8.2499999999999929,8.2499999999999947,28,28,1,2]
["Officer Complaints Sustained",9,"Less",1,1.1499999999999999,"Sum",10,0,1,0,0,0,0,9,8,9,1.3499999999999992,1.3499999999999996,1.3499999999999992,{"$error":"#N/A"},{"$error":"#N/A"},1,2]
[]
[]
[]
[]
[]
[]
[]
[]
[]
["SPARKLINE SOURCE"]
[null,11,10,9,8,7,6,5,4,3,2,1,0]
["Measure",{"$f":"OFFSET($A4,0,CurrentMonthCount-B$66,1,1)","v":"2011-02-01"},"2011-03-01","2011-04-01","2011-05-01","2011-06-01","2011-07-01","2011-08-01","2011-09-01","2011-10-01","2011-11-01","2011-12-01","2012-01-01"]
[{"$f":"A5","v":"UCR Part I Violent Crimes"},{"$f":"OFFSET($A5,0,CurrentMonthCount-B$66,1,1)","v":6},6,6,8,7,14,4,6,4,7,0,3]
[{"$f":"A6","v":"UCR Part I Property Crimes"},{"$f":"OFFSET($A6,0,CurrentMonthCount-B$66,1,1)","v":66},99,85,107,101,106,103,81,115,73,117,93]
["UCR Part II Drug Offenses",{"$f":"OFFSET($A7,0,CurrentMonthCount-B$66,1,1)","v":13},18,21,19,21,13,12,13,14,19,15,17]
["Crime Clearance Rate",{"$f":"OFFSET($A8,0,CurrentMonthCount-B$66,1,1)","v":0.3},0.65,0.54,0.65,0.47,0.4,0.61,0.82,0.50349999999999995,0.63,0.69,0.52]
["Incidents Requiring a Response (Police)",{"$f":"OFFSET($A9,0,CurrentMonthCount-B$66,1,1)","v":2405},2508,2526,2550,2493,2573,2414,2368,2769,2791,2745,2385]
["Bartow 911 Response Time (call entry to dispatch - top priority calls, secs)",{"$f":"OFFSET($A10,0,CurrentMonthCount-B$66,1,1)","v":{"$error":"#N/A"}},{"$error":"#N/A"},{"$error":"#N/A"},{"$error":"#N/A"},{"$error":"#N/A"},177,208,205,185,164,185,181]
["CPD Response Time (dispatch to arrival - top priority calls, secs)",{"$f":"OFFSET($A11,0,CurrentMonthCount-B$66,1,1)","v":{"$error":"#N/A"}},{"$error":"#N/A"},{"$error":"#N/A"},{"$error":"#N/A"},{"$error":"#N/A"},294,292,265,244,243,258,290]
["% of Top Priority Calls with Response Time < 5 Minutes (CPD dispatch to arrival)",{"$f":"OFFSET($A12,0,CurrentMonthCount-B$66,1,1)","v":{"$error":"#N/A"}},{"$error":"#N/A"},{"$error":"#N/A"},{"$error":"#N/A"},{"$error":"#N/A"},0.61,0.76,0.72,0.75,0.7,0.75,0.73]
["Traffic Citations Issued (Excluding DUI)",{"$f":"OFFSET($A13,0,CurrentMonthCount-B$66,1,1)","v":418},395,425,408,390,360,258,225,309,454,402,295]
["Traffic Accidents Reported",{"$f":"OFFSET($A14,0,CurrentMonthCount-B$66,1,1)","v":105},134,103,93,126,102,129,110,100,115,115,108]
["DUI Arrests",{"$f":"OFFSET($A15,0,CurrentMonthCount-B$66,1,1)","v":13},8,9,8,7,14,9,4,6,12,6,5]
["Staff Injuries (Police)",{"$f":"OFFSET($A16,0,CurrentMonthCount-B$66,1,1)","v":1},0,0,0,0,3,0,0,0,0,1,0]
["Training Hours Received (Police)",{"$f":"OFFSET($A17,0,CurrentMonthCount-B$66,1,1)","v":{"$error":"#N/A"}},{"$error":"#N/A"},{"$error":"#N/A"},{"$error":"#N/A"},256,126,387,200,532,160,176,213]
["Officer Complaints",{"$f":"OFFSET($A18,0,CurrentMonthCount-B$66,1,1)","v":3},7,30,13,4,4,2,0,1,2,4,7]
["Officer Complaints Sustained",{"$f":"OFFSET($A19,0,CurrentMonthCount-B$66,1,1)","v":{"$error":"#N/A"}},{"$error":"#N/A"},{"$error":"#N/A"},{"$error":"#N/A"},{"$error":"#N/A"},0,0,0,0,0,0,1]
[0,{"$f":"OFFSET($A20,0,CurrentMonthCount-B$66,1,1)","v":0},0,0,0,0,0,0,0,0,0,0,0]
[0,{"$f":"OFFSET($A21,0,CurrentMonthCount-B$66,1,1)","v":0},0,0,0,0,0,0,0,0,0,0,0]
[0,{"$f":"OFFSET($A22,0,CurrentMonthCount-B$66,1,1)","v":0},0,0,0,0,0,0,0,0,0,0,0]
[0,{"$f":"OFFSET($A23,0,CurrentMonthCount-B$66,1,1)","v":0},0,0,0,0,0,0,0,0,0,0,0]
[0,{"$f":"OFFSET($A24,0,CurrentMonthCount-B$66,1,1)","v":0},0,0,0,0,0,0,0,0,0,0,0]

{"sheet":"Fire","index":9,"n_rows":18,"n_cols":9,"rows_kept":18,"cut":false,"hidden":false,"merged":[]}
[{"$f":"CurrentMonth","v":"2012-01-01"},null,null,null,"FIRE"]
[]
["Fire Prevention","Last 12 Months","Fiscal Year to Date","FYTD",null,"Response","Last 12 Months","Fiscal Year to Date","FYTD"]
[{"$f":"'Fire Data'!A5","v":"Inspections Performed"},null,null,{"$f":"'Fire Data'!I41","v":1243},null,{"$f":"'Fire Data'!A10","v":"Incidents Requiring a Response"},null,null,{"$f":"'Fire Data'!I46","v":1821}]
[{"$f":"'Fire Data'!A6","v":"Reinspections/Follow-ups"},null,null,{"$f":"'Fire Data'!I42","v":6},null,{"$f":"'Fire Data'!A11","v":"Structure Fire Incidents"},null,null,{"$f":"'Fire Data'!I47","v":20}]
[{"$f":"'Fire Data'!A7","v":"Public Education Sessions Provided"},null,null,{"$f":"'Fire Data'!I43","v":29},null,{"$f":"'Fire Data'!A12","v":"Fire Incidents (Non-structure)"},null,null,{"$f":"'Fire Data'!I48","v":72}]
[{"$f":"'Fire Data'!A8","v":"Public Education Citizen Contacts"},null,null,{"$f":"'Fire Data'!I44","v":2941},null,{"$f":"'Fire Data'!A13","v":"Medical Assists"},null,null,{"$f":"'Fire Data'!I49","v":1212}]
[{"$f":"'Fire Data'!A9","v":"Smoke Detectors Provided to Public"},null,null,{"$f":"'Fire Data'!I45","v":35},null,{"$f":"'Fire Data'!A14","v":"False Alarms"},null,null,{"$f":"'Fire Data'!I50","v":101}]
[null,null,null,null,null,{"$f":"'Fire Data'!A15","v":"Other Calls"},null,null,{"$f":"'Fire Data'!I51","v":416}]
["Human Resources",null,null,null,null,{"$f":"'Fire Data'!A16","v":"Mutual/Automatic Aid Given"},null,null,{"$f":"'Fire Data'!I52","v":137}]
[{"$f":"'Fire Data'!A25","v":"Training Hours Received"},null,null,{"$f":"'Fire Data'!I61","v":9531.5},null,{"$f":"'Fire Data'!A17","v":"Mutual/Automatic Aid Received"},null,null,{"$f":"'Fire Data'!I53","v":18}]
[{"$f":"'Fire Data'!A26","v":"Staff Injuries"},null,null,{"$f":"'Fire Data'!I62","v":1},null,{"$f":"'Fire Data'!A18","v":"Bartow 911 Response Time (PSAP, Top Priority Calls)"},null,null,{"$f":"'Fire Data'!I54","v":152.71428571428572}]
[null,null,null,null,null,{"$f":"'Fire Data'!A19","v":"Turnout Time (Top Priority Calls)"},null,null,{"$f":"'Fire Data'!I55","v":63.428571428571431}]
[null,null,null,null,null,{"$f":"'Fire Data'!A20","v":"Response Time (Top Priority Calls)"},null,null,{"$f":"'Fire Data'!I56","v":225.85714285714286}]
[null,null,null,null,null,{"$f":"'Fire Data'!A21","v":"% of Top Priority Calls with Response Time of < 5 Mins"},null,null,{"$f":"'Fire Data'!I57","v":0.68100000000000005}]
[null,null,null,null,null,{"$f":"'Fire Data'!A22","v":"Structure Fires Contained to Room of Origin"},null,null,{"$f":"'Fire Data'!I58","v":16}]
[null,null,null,null,null,{"$f":"'Fire Data'!A23","v":"Dollar Amount of Fire Damage Loss"},null,null,{"$f":"'Fire Data'!I59","v":275470}]
[null,null,null,null,null,{"$f":"'Fire Data'!A24","v":"Dollar Amount of Fire Damage Saved"},null,null,{"$f":"'Fire Data'!I60","v":4650552}]

{"sheet":"Fire Data","index":10,"n_rows":120,"n_cols":44,"rows_kept":120,"cut":false,"hidden":false,"merged":[]}
["Fire Data"]
[]
[]
["Measure","Jul 08","2008-08-01","2008-09-01","2008-10-01","2008-11-01","2008-12-01","2009-01-01","2009-02-01","2009-03-01","2009-04-01","2009-05-01","2009-06-01","2009-07-01","2009-08-01","2009-09-01","2009-10-01","2009-11-01","2009-12-01","2010-01-01","2010-02-01","2010-03-01","2010-04-01","2010-05-01","2010-06-01","2010-07-01","2010-08-01","2010-09-01","2010-10-01","2010-11-01","2010-12-01","2011-01-01","2011-02-01","2011-03-01","2011-04-01","2011-05-01","2011-06-01","2011-07-01","2011-08-01","2011-09-01","2011-10-01","2011-11-01","2011-12-01","2012-01-01"]
["Inspections Performed",{"$error":"#N/A"},{"$error":"#N/A"},{"$error":"#N/A"},{"$error":"#N/A"},{"$error":"#N/A"},{"$error":"#N/A"},{"$error":"#N/A"},{"$error":"#N/A"},{"$error":"#N/A"},{"$error":"#N/A"},{"$error":"#N/A"},{"$error":"#N/A"},{"$error":"#N/A"},{"$error":"#N/A"},{"$error":"#N/A"},{"$error":"#N/A"},{"$error":"#N/A"},{"$error":"#N/A"},218,183,265,223,98,229,197,228,241,207,95,70,212,232,212,202,198,255,256,253,203,175,92,62,202]
["Reinspections/Follow-ups",{"$error":"#N/A"},{"$error":"#N/A"},{"$error":"#N/A"},{"$error":"#N/A"},{"$error":"#N/A"},{"$error":"#N/A"},{"$error":"#N/A"},{"$error":"#N/A"},{"$error":"#N/A"},{"$error":"#N/A"},{"$error":"#N/A"},{"$error":"#N/A"},{"$error":"#N/A"},{"$error":"#N/A"},{"$error":"#N/A"},{"$error":"#N/A"},{"$error":"#N/A"},{"$error":"#N/A"},{"$error":"#N/A"},{"$error":"#N/A"},{"$error":"#N/A"},{"$error":"#N/A"},{"$error":"#N/A"},{"$error":"#N/A"},{"$error":"#N/A"},{"$error":"#N/A"},{"$error":"#N/A"},{"$error":"#N/A"},{"$error":"#N/A"},{"$error":"#N/A"},{"$error":"#N/A"},{"$error":"#N/A"},{"$error":"#N/A"},{"$error":"#N/A"},{"$error":"#N/A"},{"$error":"#N/A"},1,2,3,0,0,0,0]
["Public Education Sessions Provided",{"$error":"#N/A"},{"$error":"#N/A"},{"$error":"#N/A"},{"$error":"#N/A"},{"$error":"#N/A"},{"$error":"#N/A"},{"$error":"#N/A"},{"$error":"#N/A"},{"$error":"#N/A"},{"$error":"#N/A"},{"$error":"#N/A"},{"$error":"#N/A"},{"$error":"#N/A"},{"$error":"#N/A"},{"$error":"#N/A"},{"$error":"#N/A"},{"$error":"#N/A"},{"$error":"#N/A"},3,1,4,3,5,2,1,0,10,18,1,0,0,2,7,3,6,5,1,1,12,11,2,2,0]
["Public Education Citizen Contacts",{"$error":"#N/A"},{"$error":"#N/A"},{"$error":"#N/A"},{"$error":"#N/A"},{"$error":"#N/A"},{"$error":"#N/A"},{"$error":"#N/A"},{"$error":"#N/A"},{"$error":"#N/A"},{"$error":"#N/A"},{"$error":"#N/A"},{"$error":"#N/A"},{"$error":"#N/A"},{"$error":"#N/A"},{"$error":"#N/A"},{"$error":"#N/A"},{"$error":"#N/A"},{"$error":"#N/A"},{"$error":"#N/A"},{"$error":"#N/A"},{"$error":"#N/A"},{"$error":"#N/A"},{"$error":"#N/A"},{"$error":"#N/A"},{"$error":"#N/A"},{"$error":"#N/A"},{"$error":"#N/A"},{"$error":"#N/A"},{"$error":"#N/A"},{"$error":"#N/A"},{"$error":"#N/A"},{"$error":"#N/A"},188,142,1284,260,50,8,701,1988,132,62,0]
["Smoke Detectors Provided to Public",{"$error":"#N/A"},{"$error":"#N/A"},{"$error":"#N/A"},{"$error":"#N/A"},{"$error":"#N/A"},{"$error":"#N/A"},{"$error":"#N/A"},{"$error":"#N/A"},{"$error":"#N/A"},{"$error":"#N/A"},{"$error":"#N/A"},{"$error":"#N/A"},{"$error":"#N/A"},{"$error":"#N/A"},{"$error":"#N/A"},{"$error":"#N/A"},{"$error":"#N/A"},{"$error":"#N/A"},{"$error":"#N/A"},{"$error":"#N/A"},{"$error":"#N/A"},{"$error":"#N/A"},{"$error":"#N/A"},{"$error":"#N/A"},{"$error":"#N/A"},{"$error":"#N/A"},{"$error":"#N/A"},{"$error":"#N/A"},{"$error":"#N/A"},{"$error":"#N/A"},{"$error":"#N/A"},{"$error":"#N/A"},{"$error":"#N/A"},{"$error":"#N/A"},{"$error":"#N/A"},{"$error":"#N/A"},2,2,10,9,0,12,0]
["Incidents Requiring a Response",{"$error":"#N/A"},{"$error":"#N/A"},{"$error":"#N/A"},{"$error":"#N/A"},{"$error":"#N/A"},{"$error":"#N/A"},{"$error":"#N/A"},{"$error":"#N/A"},{"$error":"#N/A"},{"$error":"#N/A"},{"$error":"#N/A"},{"$error":"#N/A"},{"$error":"#N/A"},{"$error":"#N/A"},{"$error":"#N/A"},{"$error":"#N/A"},{"$error":"#N/A"},{"$error":"#N/A"},277,211,249,273,235,267,241,274,237,268,288,247,276,267,282,243,277,265,273,290,256,255,249,261,237]
["Structure Fire Incidents",{"$error":"#N/A"},{"$error":"#N/A"},{"$error":"#N/A"},{"$error":"#N/A"},{"$error":"#N/A"},{"$error":"#N/A"},{"$error":"#N/A"},{"$error":"#N/A"},{"$error":"#N/A"},{"$error":"#N/A"},{"$error":"#N/A"},{"$error":"#N/A"},{"$error":"#N/A"},{"$error":"#N/A"},{"$error":"#N/A"},{"$error":"#N/A"},{"$error":"#N/A"},{"$error":"#N/A"},{"$error":"#N/A"},{"$error":"#N/A"},{"$error":"#N/A"},{"$error":"#N/A"},{"$error":"#N/A"},{"$error":"#N/A"},{"$error":"#N/A"},{"$error":"#N/A"},{"$error":"#N/A"},{"$error":"#N/A"},{"$error":"#N/A"},{"$error":"#N/A"},{"$error":"#N/A"},{"$error":"#N/A"},4,3,1,1,1,3,1,1,4,10,0]
["Fire Incidents (Non-structure)",{"$error":"#N/A"},{"$error":"#N/A"},{"$error":"#N/A"},{"$error":"#N/A"},{"$error":"#N/A"},{"$error":"#N/A"},{"$error":"#N/A"},{"$error":"#N/A"},{"$error":"#N/A"},{"$error":"#N/A"},{"$error":"#N/A"},{"$error":"#N/A"},{"$error":"#N/A"},{"$error":"#N/A"},{"$error":"#N/A"},{"$error":"#N/A"},{"$error":"#N/A"},{"$error":"#N/A"},{"$error":"#N/A"},{"$error":"#N/A"},{"$error":"#N/A"},{"$error":"#N/A"},{"$error":"#N/A"},{"$error":"#N/A"},{"$error":"#N/A"},{"$error":"#N/A"},{"$error":"#N/A"},{"$error":"#N/A"},{"$error":"#N/A"},{"$error":"#N/A"},{"$error":"#N/A"},{"$error":"#N/A"},11,15,9,6,5,15,13,11,13,9,6]
["Medical Assists",{"$error":"#N/A"},{"$error":"#N/A"},{"$error":"#N/A"},{"$error":"#N/A"},{"$error":"#N/A"},{"$error":"#N/A"},{"$error":"#N/A"},{"$error":"#N/A"},{"$error":"#N/A"},{"$error":"#N/A"},{"$error":"#N/A"},{"$error":"#N/A"},{"$error":"#N/A"},{"$error":"#N/A"},{"$error":"#N/A"},{"$error":"#N/A"},{"$error":"#N/A"},{"$error":"#N/A"},175,144,181,188,168,171,157,169,172,175,187,161,186,169,190,165,208,163,165,181,168,187,160,187,164]
["False Alarms",{"$error":"#N/A"},{"$error":"#N/A"},{"$error":"#N/A"},{"$error":"#N/A"},{"$error":"#N/A"},{"$error":"#N/A"},{"$error":"#N/A"},{"$error":"#N/A"},{"$error":"#N/A"},{"$error":"#N/A"},{"$error":"#N/A"},{"$error":"#N/A"},{"$error":"#N/A"},{"$error":"#N/A"},{"$error":"#N/A"},{"$error":"#N/A"},{"$error":"#N/A"},{"$error":"#N/A"},26,12,12,11,12,18,12,19,14,23,24,14,8,15,14,11,11,16,22,19,13,7,13,10,17]
["Other Calls",{"$error":"#N/A"},{"$error":"#N/A"},{"$error":"#N/A"},{"$error":"#N/A"},{"$error":"#N/A"},{"$error":"#N/A"},{"$error":"#N/A"},{"$error":"#N/A"},{"$error":"#N/A"},{"$error":"#N/A"},{"$error":"#N/A"},{"$error":"#N/A"},{"$error":"#N/A"},{"$error":"#N/A"},{"$error":"#N/A"},{"$error":"#N/A"},{"$error":"#N/A"},{"$error":"#N/A"},61,45,40,52,47,74,60,79,41,53,63,54,63,52,63,49,48,78,80,72,61,49,59,45,50]
["Mutual/Automatic Aid Given",{"$error":"#N/A"},{"$error":"#N/A"},{"$error":"#N/A"},{"$error":"#N/A"},{"$error":"#N/A"},{"$error":"#N/A"},{"$error":"#N/A"},{"$error":"#N/A"},{"$error":"#N/A"},{"$error":"#N/A"},{"$error":"#N/A"},{"$error":"#N/A"},{"$error":"#N/A"},{"$error":"#N/A"},{"$error":"#N/A"},{"$error":"#N/A"},{"$error":"#N/A"},{"$error":"#N/A"},27,18,28,27,22,27,20,24,22,22,33,18,21,27,26,19,28,26,22,17,20,19,19,22,18]
["Mutual/Automatic Aid Received",{"$error":"#N/A"},{"$error":"#N/A"},{"$error":"#N/A"},{"$error":"#N/A"},{"$error":"#N/A"},{"$error":"#N/A"},{"$error":"#N/A"},{"$error":"#N/A"},{"$error":"#N/A"},{"$error":"#N/A"},{"$error":"#N/A"},{"$error":"#N/A"},{"$error":"#N/A"},{"$error":"#N/A"},{"$error":"#N/A"},{"$error":"#N/A"},{"$error":"#N/A"},{"$error":"#N/A"},5,3,3,3,1,3,2,4,2,5,2,5,0,10,2,4,1,2,2,5,2,1,3,2,3]
["Bartow 911 Response Time (PSAP, Top Priority Calls)",{"$error":"#N/A"},{"$error":"#N/A"},{"$error":"#N/A"},{"$error":"#N/A"},{"$error":"#N/A"},{"$error":"#N/A"},{"$error":"#N/A"},{"$error":"#N/A"},{"$error":"#N/A"},{"$error":"#N/A"},{"$error":"#N/A"},{"$error":"#N/A"},{"$error":"#N/A"},{"$error":"#N/A"},{"$error":"#N/A"},{"$error":"#N/A"},{"$error":"#N/A"},{"$error":"#N/A"},{"$error":"#N/A"},{"$error":"#N/A"},{"$error":"#N/A"},{"$error":"#N/A"},{"$error":"#N/A"},{"$error":"#N/A"},{"$error":"#N/A"},{"$error":"#N/A"},{"$error":"#N/A"},{"$error":"#N/A"},{"$error":"#N/A"},{"$error":"#N/A"},{"$error":"#N/A"},{"$error":"#N/A"},{"$error":"#N/A"},{"$error":"#N/A"},{"$error":"#N/A"},{"$error":"#N/A"},147,148,151,161,152,159,151]
["Turnout Time (Top Priority Calls)",{"$error":"#N/A"},{"$error":"#N/A"},{"$error":"#N/A"},{"$error":"#N/A"},{"$error":"#N/A"},{"$error":"#N/A"},{"$error":"#N/A"},{"$error":"#N/A"},{"$error":"#N/A"},{"$error":"#N/A"},{"$error":"#N/A"},{"$error":"#N/A"},{"$error":"#N/A"},{"$error":"#N/A"},{"$error":"#N/A"},{"$error":"#N/A"},{"$error":"#N/A"},{"$error":"#N/A"},{"$error":"#N/A"},{"$error":"#N/A"},{"$error":"#N/A"},{"$error":"#N/A"},{"$error":"#N/A"},{"$error":"#N/A"},{"$error":"#N/A"},{"$error":"#N/A"},{"$error":"#N/A"},{"$error":"#N/A"},{"$error":"#N/A"},{"$error":"#N/A"},{"$error":"#N/A"},{"$error":"#N/A"},{"$error":"#N/A"},{"$error":"#N/A"},{"$error":"#N/A"},{"$error":"#N/A"},56,74,57,71,61,69,56]
["Response Time (Top Priority Calls)",{"$error":"#N/A"},{"$error":"#N/A"},{"$error":"#N/A"},{"$error":"#N/A"},{"$error":"#N/A"},{"$error":"#N/A"},{"$error":"#N/A"},{"$error":"#N/A"},{"$error":"#N/A"},{"$error":"#N/A"},{"$error":"#N/A"},{"$error":"#N/A"},{"$error":"#N/A"},{"$error":"#N/A"},{"$error":"#N/A"},{"$error":"#N/A"},{"$error":"#N/A"},{"$error":"#N/A"},{"$error":"#N/A"},{"$error":"#N/A"},{"$error":"#N/A"},{"$error":"#N/A"},{"$error":"#N/A"},{"$error":"#N/A"},{"$error":"#N/A"},{"$error":"#N/A"},{"$error":"#N/A"},{"$error":"#N/A"},{"$error":"#N/A"},{"$error":"#N/A"},{"$error":"#N/A"},{"$error":"#N/A"},{"$error":"#N/A"},{"$error":"#N/A"},{"$error":"#N/A"},{"$error":"#N/A"},200,228,247,213,217,241,235]
["% of Top Priority Calls with Response Time of < 5 Mins",{"$error":"#N/A"},{"$error":"#N/A"},{"$error":"#N/A"},{"$error":"#N/A"},{"$error":"#N/A"},{"$error":"#N/A"},{"$error":"#N/A"},{"$error":"#N/A"},{"$error":"#N/A"},{"$error":"#N/A"},{"$error":"#N/A"},{"$error":"#N/A"},{"$error":"#N/A"},{"$error":"#N/A"},{"$error":"#N/A"},{"$error":"#N/A"},{"$error":"#N/A"},{"$error":"#N/A"},0.68,0.63,0.63,0.7,0.77,0.71,0.68,0.74,0.68500000000000005,0.69,0.57999999999999996,0.623,0.64,0.66,0.66,0.69,0.7,0.9,0.74199999999999999,0.66200000000000003,0.67900000000000005,0.68,0.6,0.70399999999999996,0.7]
["Structure Fires Contained to Room of Origin",{"$error":"#N/A"},{"$error":"#N/A"},{"$error":"#N/A"},{"$error":"#N/A"},{"$error":"#N/A"},{"$error":"#N/A"},{"$error":"#N/A"},{"$error":"#N/A"},{"$error":"#N/A"},{"$error":"#N/A"},{"$error":"#N/A"},{"$error":"#N/A"},{"$error":"#N/A"},{"$error":"#N/A"},{"$error":"#N/A"},{"$error":"#N/A"},{"$error":"#N/A"},{"$error":"#N/A"},{"$error":"#N/A"},{"$error":"#N/A"},{"$error":"#N/A"},{"$error":"#N/A"},{"$error":"#N/A"},{"$error":"#N/A"},{"$error":"#N/A"},{"$error":"#N/A"},{"$error":"#N/A"},{"$error":"#N/A"},{"$error":"#N/A"},{"$error":"#N/A"},{"$error":"#N/A"},{"$error":"#N/A"},3,2,1,1,1,3,1,1,3,7,0]
["Dollar Amount of Fire Damage Loss",{"$error":"#N/A"},{"$error":"#N/A"},{"$error":"#N/A"},{"$error":"#N/A"},{"$error":"#N/A"},{"$error":"#N/A"},{"$error":"#N/A"},{"$error":"#N/A"},{"$error":"#N/A"},{"$error":"#N/A"},{"$error":"#N/A"},{"$error":"#N/A"},{"$error":"#N/A"},{"$error":"#N/A"},{"$error":"#N/A"},{"$error":"#N/A"},{"$error":"#N/A"},{"$error":"#N/A"},45000,3800,114350,135209,5010,2600,23500,52770,25700,6500,20500,14700,71300,15000,320175,54150,3000,500,25000,40600,9700,2250,46000,146820,5100]
["Dollar Amount of Fire Damage Saved",{"$error":"#N/A"},{"$error":"#N/A"},{"$error":"#N/A"},{"$error":"#N/A"},{"$error":"#N/A"},{"$error":"#N/A"},{"$error":"#N/A"},{"$error":"#N/A"},{"$error":"#N/A"},{"$error":"#N/A"},{"$error":"#N/A"},{"$error":"#N/A"},{"$error":"#N/A"},{"$error":"#N/A"},{"$error":"#N/A"},{"$error":"#N/A"},{"$error":"#N/A"},{"$error":"#N/A"},{"$error":"#N/A"},{"$error":"#N/A"},{"$error":"#N/A"},{"$error":"#N/A"},{"$error":"#N/A"},{"$error":"#N/A"},{"$error":"#N/A"},{"$error":"#N/A"},{"$error":"#N/A"},{"$error":"#N/A"},{"$error":"#N/A"},{"$error":"#N/A"},{"$error":"#N/A"},{"$error":"#N/A"},713500,403000,{"$error":"#N/A"},{"$error":"#N/A"},325000,288800,2550,219000,846600,2206102,762500]
["Training Hours Received",{"$error":"#N/A"},{"$error":"#N/A"},{"$error":"#N/A"},{"$error":"#N/A"},{"$error":"#N/A"},{"$error":"#N/A"},{"$error":"#N/A"},{"$error":"#N/A"},{"$error":"#N/A"},{"$error":"#N/A"},{"$error":"#N/A"},{"$error":"#N/A"},{"$error":"#N/A"},{"$error":"#N/A"},{"$error":"#N/A"},{"$error":"#N/A"},{"$error":"#N/A"},{"$error":"#N/A"},1387.5,1995,2034.5,1526,1576,1418,1394.5,1581,2102,1407,1289,737,2076,1927,2135,1539,1311,1574,1589,1943.5,1266.5,1628.5,944,485,1675]
["Staff Injuries",{"$error":"#N/A"},{"$error":"#N/A"},{"$error":"#N/A"},{"$error":"#N/A"},{"$error":"#N/A"},{"$error":"#N/A"},{"$error":"#N/A"},{"$error":"#N/A"},{"$error":"#N/A"},{"$error":"#N/A"},{"$error":"#N/A"},{"$error":"#N/A"},{"$error":"#N/A"},{"$error":"#N/A"},{"$error":"#N/A"},{"$error":"#N/A"},{"$error":"#N/A"},{"$error":"#N/A"},0,0,1,0,0,2,0,0,1,1,1,0,0,1,0,1,0,0,1,0,0,0,0,0,0]
["HIGHLIGHTS","Jul 08","2008-08-01","2008-09-01","2008-10-01","2008-11-01","2008-12-01","2009-01-01","2009-02-01","2009-03-01","2009-04-01","2009-05-01","2009-06-01","2009-07-01","2009-08-01","2009-09-01","2009-10-01","2009-11-01","2009-12-01","2010-01-01","2010-02-01","2010-03-01","2010-04-01","2010-05-01","2010-06-01","2010-07-01","2010-08-01","2010-09-01","2010-10-01","2010-11-01","2010-12-01","2011-01-01","2011-02-01","2011-03-01","2011-04-01","2011-05-01","2011-06-01","2011-07-01","2011-08-01","2011-09-01","2011-10-01","2011-11-01","2011-12-01","2012-01-01"]
["Highlight 1",null,null,null,null,null,null,null,null,null,null,null,null,null,null,null,null,null,null,null,null,null,null,null,null,null,null,null,null,null,null,null,null,null,null,null,null,"1.  On July 10th, the Cartersville Fire Department responded to a fire in an apartment above the historic Legion Theater.  The Fire Department was successful in containing the fire to the room of origin, saving this valuable historic landmark.","1. One civilian fire fatality in motor vehicle crash / vehicle fire","1.  Technical swift water Rescue training conducted on the Etowah River.","Heavy push for community outreach during Fire Prevention Month","During November there was one fire related civilian injury caused by smoke inhalation.","1 Civilian injury on structure fire 12/26/2011. Minor Burn","No Structure Fires for Month / 2 cooking fires confined to stove / No Structure Damage."]
["Highlight 2",null,null,null,null,null,null,null,null,null,null,null,null,null,null,null,null,null,null,null,null,null,null,null,null,null,null,null,null,null,null,null,null,null,null,null,null,null,"2. Large open land fire in Carter Grove subdivision, we were assisted by Bartow County and Ga. Forestry","2.  Georgia Fire Conference held in Columbus.  Chief Carter began 2nd year as State President of Georgia Firefighters.","Held 3rd annual open house at Station #1","A structure fire in an apartment was contained to the room of origin, due to the activcation of the apartment's sprinkler system.","Downtown fire on 12/03/2011 extensive damage to one structure, fire contained 5 connecting business/offices saved","Conducted meeting with Major Pruitt from Bartow 911 to address dispatch time."]
["Highlight 3",null,null,null,null,null,null,null,null,null,null,null,null,null,null,null,null,null,null,null,null,null,null,null,null,null,null,null,null,null,null,null,null,null,null,null,null,null,null,"3.  Staff visited construction site of two new fire apparatus to inspect trucks.  Trucks are currently in Forsyth, being outfitted with sirens and other equipment.  (See Picture)","Overtime higher than normal due to high public education push and extra instruction for new hires","All required ISO and State training and drills have been completed for the year of 2011."]
["Highlight 4",null,null,null,null,null,null,null,null,null,null,null,null,null,null,null,null,null,null,null,null,null,null,null,null,null,null,null,null,null,null,null,null,null,null,null,null,null,null,null,null,"Construction of the new Public Safety Headquarters is progressing on schedule.  All infrastructure is in place, and the old gas line running through the property has been relocated.  Footings for the structure are now 90% complete."]
["Highlight 5",null,null,null,null,null,null,null,null,null,null,null,null,null,null,null,null,null,null,null,null,null,null,null,null,null,null,null,null,null,null,null,null,null,null,null,null,null,null,null,null,"Demolition of Old Firestation #2 is complete.  New Firestation on MLK is scheduled to begin construction in January."]
["Highlight 6"]
["Highlight 7"]
["Highlight 8"]
["Highlights Concaetenation",{"$f":"B28&CHAR(10)&B29&CHAR(10)&B30&CHAR(10)&B31&CHAR(10)&B32&CHAR(10)&B33&CHAR(10)&B34&CHAR(10)&B35","v":"\n\n\n\n\n\n\n"},{"$f":"C28&CHAR(10)&C29&CHAR(10)&C30&CHAR(10)&C31&CHAR(10)&C32&CHAR(10)&C33&CHAR(10)&C34&CHAR(10)&C35","v":"\n\n\n\n\n\n\n"},"\n\n\n\n\n\n\n","\n\n\n\n\n\n\n","\n\n\n\n\n\n\n","\n\n\n\n\n\n\n","\n\n\n\n\n\n\n","\n\n\n\n\n\n\n","\n\n\n\n\n\n\n","\n\n\n\n\n\n\n","\n\n\n\n\n\n\n","\n\n\n\n\n\n\n","\n\n\n\n\n\n\n","\n\n\n\n\n\n\n","\n\n\n\n\n\n\n","\n\n\n\n\n\n\n","\n\n\n\n\n\n\n","\n\n\n\n\n\n\n","\n\n\n\n\n\n\n","\n\n\n\n\n\n\n","\n\n\n\n\n\n\n","\n\n\n\n\n\n\n","\n\n\n\n\n\n\n","\n\n\n\n\n\n\n","\n\n\n\n\n\n\n","\n\n\n\n\n\n\n","\n\n\n\n\n\n\n","\n\n\n\n\n\n\n","\n\n\n\n\n\n\n","\n\n\n\n\n\n\n","\n\n\n\n\n\n\n","\n\n\n\n\n\n\n","\n\n\n\n\n\n\n","\n\n\n\n\n\n\n","\n\n\n\n\n\n\n",{"$f":"AK28&CHAR(10)&CHAR(10)&AK29&CHAR(10)&CHAR(10)&AK30&CHAR(10)&CHAR(10)&AK31&CHAR(10)&CHAR(10)&AK32&CHAR(10)&CHAR(10)&AK33&CHAR(10)&CHAR(10)&AK34&CHAR(10)&CHAR(10)&AK35","v":"\n\n\n\n\n\n\n\n\n\n\n\n\n\n"},{"$f":"AL28&CHAR(10)&CHAR(10)&AL29&CHAR(10)&CHAR(10)&AL30&CHAR(10)&CHAR(10)&AL31&CHAR(10)&CHAR(10)&AL32&CHAR(10)&CHAR(10)&AL33&CHAR(10)&CHAR(10)&AL34&CHAR(10)&CHAR(10)&AL35","v":"1.  On July 10th, the Cartersville Fire Department responded to a fire in an apartment above the historic Legion Theater.  The Fire Department was successful in containing the fire to the room of origin, saving this valuable historic landmark.\n\n\n\n\n\n\n\n\n\n\n\n\n\n"},{"$f":"AM28&CHAR(10)&CHAR(10)&AM29&CHAR(10)&CHAR(10)&AM30&CHAR(10)&CHAR(10)&AM31&CHAR(10)&CHAR(10)&AM32&CHAR(10)&CHAR(10)&AM33&CHAR(10)&CHAR(10)&AM34&CHAR(10)&CHAR(10)&AM35","v":"1. One civilian fire fatality in motor vehicle crash / vehicle fire\n\n2. Large open land fire in Carter Grove subdivision, we were assisted by Bartow County and Ga. Forestry\n\n\n\n\n\n\n\n\n\n\n\n"},{"$f":"AN28&CHAR(10)&CHAR(10)&AN29&CHAR(10)&CHAR(10)&AN30&CHAR(10)&CHAR(10)&AN31&CHAR(10)&CHAR(10)&AN32&CHAR(10)&CHAR(10)&AN33&CHAR(10)&CHAR(10)&AN34&CHAR(10)&CHAR(10)&AN35","v":"1.  Technical swift water Rescue training conducted on the Etowah River.\n\n2.  Georgia Fire Conference held in Columbus.  Chief Carter began 2nd year as State President of Georgia Firefighters.\n\n3.  Staff visited construction site of two new fire apparatus to inspect trucks.  Trucks are currently in Forsyth, being outfitted with sirens and other equipment.  (See Picture)\n\n\n\n\n\n\n\n\n\n"},{"$f":"AO28&CHAR(10)&CHAR(10)&AO29&CHAR(10)&CHAR(10)&AO30&CHAR(10)&CHAR(10)&AO31&CHAR(10)&CHAR(10)&AO32&CHAR(10)&CHAR(10)&AO33&CHAR(10)&CHAR(10)&AO34&CHAR(10)&CHAR(10)&AO35","v":"Heavy push for community outreach during Fire Prevention Month\n\nHeld 3rd annual open house at Station #1\n\nOvertime higher than normal due to high public education push and extra instruction for new hires\n\n\n\n\n\n\n\n\n\n"},{"$f":"AP28&CHAR(10)&CHAR(10)&AP29&CHAR(10)&CHAR(10)&AP30&CHAR(10)&CHAR(10)&AP31&CHAR(10)&CHAR(10)&AP32&CHAR(10)&CHAR(10)&AP33&CHAR(10)&CHAR(10)&AP34&CHAR(10)&CHAR(10)&AP35","v":"During November there was one fire related civilian injury caused by smoke inhalation.\n\nA structure fire in an apartment was contained to the room of origin, due to the activcation of the apartment's sprinkler system.\n\nAll required ISO and State training and drills have been completed for the year of 2011.\n\nConstruction of the new Public Safety Headquarters is progressing on schedule.  All infrastructure is in place, and the old gas line running through the property has been relocated.  Footings for the structure are now 90% complete.\n\nDemolition of Old Firestation #2 is complete.  New Firestation on MLK is scheduled to begin construction in January.\n\n\n\n\n\n"},{"$f":"AQ28&CHAR(10)&CHAR(10)&AQ29&CHAR(10)&CHAR(10)&AQ30&CHAR(10)&CHAR(10)&AQ31&CHAR(10)&CHAR(10)&AQ32&CHAR(10)&CHAR(10)&AQ33&CHAR(10)&CHAR(10)&AQ34&CHAR(10)&CHAR(10)&AQ35","v":"1 Civilian injury on structure fire 12/26/2011. Minor Burn\n\nDowntown fire on 12/03/2011 extensive damage to one structure, fire contained 5 connecting business/offices saved\n\n\n\n\n\n\n\n\n\n\n\n"},{"$f":"AR28&CHAR(10)&CHAR(10)&AR29&CHAR(10)&CHAR(10)&AR30&CHAR(10)&CHAR(10)&AR31&CHAR(10)&CHAR(10)&AR32&CHAR(10)&CHAR(10)&AR33&CHAR(10)&CHAR(10)&AR34&CHAR(10)&CHAR(10)&AR35","v":"No Structure Fires for Month / 2 cooking fires confined to stove / No Structure Damage.\n\nConducted meeting with Major Pruitt from Bartow 911 to address dispatch time.\n\n\n\n\n\n\n\n\n\n\n\n"}]
[]
[]
[]
["Bullet Chart Source","Target","What's Better?","Band 1","Band 2","YTD Type","Max Scale","Actual 1","Actual","Actual 3","Projection 1","Projection 2","Projection 3","First Zone 1","First Zone 2","First Zone 3","Second Zone 1","Second Zone 2","Second Zone 3","Previous X 1","Previous X 2","Previous Y 1","Previous Y 2"]
[{"$f":"A5","v":"Inspections Performed"},2367,"More",0.85,1,"Sum",{"$f":"ROUNDUP((ROUNDUP(MAX(B41,SUM(I41,L41)),-LEN(EVEN(MAX(B41,SUM(I41,L41))))+2)/5),-LEN(EVEN(ROUNDUP(MAX(B41,SUM(I41,L41)),-LEN(EVEN(MAX(B41,SUM(I41,L41))))+2)/5))+1)*5","v":2500},0,{"$f":"IF(F41=\"Sum\",SUM(OFFSET(A5,0,YTDBeg,1,YTDWidth)),AVERAGE(OFFSET(A5,0,YTDBeg,1,YTDWidth)))","v":1243},0,0,{"$f":"IF(F41=\"Sum\",Projection*(I41/YTDWidth*12-I41),0)","v":0},0,{"$f":"B41*D41","v":2011.95},{"$f":"((I41+L41<=N41)*(N41-(I41+L41)))","v":768.95},{"$f":"N41","v":2011.95},{"$f":"(E41-D41)*B41","v":355.05000000000007},{"$f":"((I41+L41<=N41+Q41)*((N41+Q41)-(I41+L41+O41)))","v":355.04999999999995},{"$f":"Q41","v":355.05000000000007},{"$f":"IF(F41=\"Sum\",SUM(OFFSET(A5,0,YTDBeg-12,1,YTDWidth)),AVERAGE(OFFSET(A5,0,YTDBeg-12,1,YTDWidth)))","v":1250},{"$f":"T41","v":1250},1,2]
[{"$f":"A6","v":"Reinspections/Follow-ups"},100,"Less",1,1.1499999999999999,"Sum",{"$f":"ROUNDUP((ROUNDUP(MAX(B42,SUM(I42,L42)),-LEN(EVEN(MAX(B42,SUM(I42,L42))))+2)/5),-LEN(EVEN(ROUNDUP(MAX(B42,SUM(I42,L42)),-LEN(EVEN(MAX(B42,SUM(I42,L42))))+2)/5))+1)*5","v":100},0,6,0,0,0,0,100,{"$f":"((I42+L42<=N42)*(N42-(I42+L42)))","v":94},{"$f":"N42","v":100},14.999999999999991,{"$f":"((I42+L42<=N42+Q42)*((N42+Q42)-(I42+L42+O42)))","v":14.999999999999986},{"$f":"Q42","v":14.999999999999991},{"$error":"#N/A"},{"$f":"T42","v":{"$error":"#N/A"}},1,2]
["Public Education Sessions Provided",50,"More",0.85,1,"Sum",50,0,29,0,0,0,0,42.5,13.5,42.5,7.5000000000000009,7.5,7.5000000000000009,30,30,1,2]
["Public Education Citizen Contacts",3361,"More",0.85,1,"Sum",3500,0,2941,0,0,0,0,2856.85,0,2856.85,504.15000000000009,420,504.15000000000009,{"$error":"#N/A"},{"$error":"#N/A"},1,2]
["Smoke Detectors Provided to Public",108,"More",0.85,1,"Sum",150,0,35,0,0,0,0,91.8,56.8,91.8,16.200000000000003,16.200000000000003,16.200000000000003,{"$error":"#N/A"},{"$error":"#N/A"},1,2]
["Incidents Requiring a Response",3067,"Less",1,1.1499999999999999,"Sum",3500,0,1821,0,0,0,0,3067,1246,3067,460.04999999999973,460.04999999999973,460.04999999999973,1831,1831,1,2]
["Structure Fire Incidents",44,"Less",1,1.1499999999999999,"Sum",50,0,20,0,0,0,0,44,24,44,6.5999999999999961,6.5999999999999943,6.5999999999999961,{"$error":"#N/A"},{"$error":"#N/A"},1,2]
["Fire Incidents (Non-structure)",104,"Less",1,1.1499999999999999,"Sum",150,0,72,0,0,0,0,104,32,104,15.599999999999991,15.599999999999994,15.599999999999991,{"$error":"#N/A"},{"$error":"#N/A"},1,2]
["Medical Assists",2048,"Less",1,1.1499999999999999,"Sum",2500,0,1212,0,0,0,0,2048,836,2048,307.19999999999982,307.19999999999982,307.19999999999982,1207,1207,1,2]
["False Alarms",197,"Less",1,1.1499999999999999,"Sum",200,0,101,0,0,0,0,197,96,197,29.549999999999983,29.549999999999983,29.549999999999983,114,114,1,2]
["Other Calls",669,"Less",1,1.1499999999999999,"Sum",1000,0,416,0,0,0,0,669,253,669,100.34999999999994,100.34999999999991,100.34999999999994,413,413,1,2]
["Mutual/Automatic Aid Given",288,"Less",1,1.1499999999999999,"Sum",300,0,137,0,0,0,0,288,151,288,43.199999999999974,43.199999999999989,43.199999999999974,160,160,1,2]
["Mutual/Automatic Aid Received",38,"Less",1,1.1499999999999999,"Sum",40,0,18,0,0,0,0,38,20,38,5.6999999999999966,5.6999999999999957,5.6999999999999966,20,20,1,2]
["Bartow 911 Response Time (PSAP, Top Priority Calls)",120,"Less",1,1.1499999999999999,"Average",200,0,152.71428571428572,0,0,0,0,120,0,120,17.999999999999989,0,17.999999999999989,{"$error":"#N/A"},{"$error":"#N/A"},1,2]
["Turnout Time (Top Priority Calls)",60,"Less",1,1.1499999999999999,"Average",100,0,63.428571428571431,0,0,0,0,60,0,60,8.9999999999999947,5.5714285714285694,8.9999999999999947,{"$error":"#N/A"},{"$error":"#N/A"},1,2]
["Response Time (Top Priority Calls)",300,"Less",1,1.1499999999999999,"Average",300,0,225.85714285714286,0,0,0,0,{"$f":"B56*D56","v":300},{"$f":"((I56+L56<=N56)*(N56-(I56+L56)))","v":74.142857142857139},{"$f":"N56","v":300},{"$f":"(E56-D56)*B56","v":44.999999999999972},{"$f":"((I56+L56<=N56+Q56)*((N56+Q56)-(I56+L56+O56)))","v":45},{"$f":"Q56","v":44.999999999999972},{"$error":"#N/A"},{"$error":"#N/A"},1,2]
["% of Top Priority Calls with Response Time of < 5 Mins",0.68,"More",0.85,1,"Average",1,0,0.68100000000000005,0,0,0,0,0.57800000000000007,0,0.57800000000000007,0.10200000000000002,0,0.10200000000000002,0.66257142857142859,0.66257142857142859,1,2]
["Structure Fires Contained to Room of Origin",{"$f":"0.9*I47","v":18},"More",0.85,1,"Sum",20,0,16,0,0,0,0,15.299999999999999,0,15.299999999999999,2.7,2,2.7,{"$error":"#N/A"},{"$error":"#N/A"},1,2]
["Dollar Amount of Fire Damage Loss",449639,"Less",1,1.1499999999999999,"Sum",450000,0,275470,0,0,0,0,449639,174169,449639,67445.849999999962,67445.849999999977,67445.849999999962,214970,214970,1,2]
["Dollar Amount of Fire Damage Saved",5580900,"More",0.85,1,"Sum",{"$f":"ROUNDUP((ROUNDUP(MAX(B60,SUM(I60,L60)),-LEN(EVEN(MAX(B60,SUM(I60,L60))))+2)/5),-LEN(EVEN(ROUNDUP(MAX(B60,SUM(I60,L60)),-LEN(EVEN(MAX(B60,SUM(I60,L60))))+2)/5))+1)*5","v":10000000},0,{"$f":"IF(F60=\"Sum\",SUM(OFFSET(A24,0,YTDBeg,1,YTDWidth)),AVERAGE(OFFSET(A24,0,YTDBeg,1,YTDWidth)))","v":4650552},0,0,{"$f":"IF(F60=\"Sum\",Projection*(I60/YTDWidth*12-I60),0)","v":0},0,{"$f":"B60*D60","v":4743765},{"$f":"((I60+L60<=N60)*(N60-(I60+L60)))","v":93213},{"$f":"N60","v":4743765},{"$f":"(E60-D60)*B60","v":837135.00000000012},{"$f":"((I60+L60<=N60+Q60)*((N60+Q60)-(I60+L60+O60)))","v":837135},{"$f":"Q60","v":837135.00000000012},{"$f":"IF(F60=\"Sum\",SUM(OFFSET(A24,0,YTDBeg-12,1,YTDWidth)),AVERAGE(OFFSET(A24,0,YTDBeg-12,1,YTDWidth)))","v":{"$error":"#N/A"}},{"$f":"T60","v":{"$error":"#N/A"}},1,2]
["Training Hours Received",18910,"More",0.85,1,"Sum",20000,0,9531.5,0,0,0,0,16073.5,6542,16073.5,2836.5000000000005,2836.5,2836.5000000000005,10586.5,10586.5,1,2]
["Staff Injuries",4,"Less",1,1.1499999999999999,"Sum",5,0,1,0,0,0,0,4,3,4,0.59999999999999964,0.59999999999999964,0.59999999999999964,3,3,1,2]
[]
[]
["SPARKLINE SOURCE"]
[null,11,10,9,8,7,6,5,4,3,2,1,0]
["Measure",{"$f":"OFFSET($A4,0,CurrentMonthCount-B$66,1,1)","v":"2011-02-01"},"2011-03-01","2011-04-01","2011-05-01","2011-06-01","2011-07-01","2011-08-01","2011-09-01","2011-10-01","2011-11-01","2011-12-01","2012-01-01"]
[{"$f":"A5","v":"Inspections Performed"},{"$f":"OFFSET($A5,0,CurrentMonthCount-B$66,1,1)","v":232},212,202,198,255,256,253,203,175,92,62,202]
[{"$f":"A6","v":"Reinspections/Follow-ups"},{"$f":"OFFSET($A6,0,CurrentMonthCount-B$66,1,1)","v":{"$error":"#N/A"}},{"$error":"#N/A"},{"$error":"#N/A"},{"$error":"#N/A"},{"$error":"#N/A"},1,2,3,0,0,0,0]
["Public Education Sessions Provided",{"$f":"OFFSET($A7,0,CurrentMonthCount-B$66,1,1)","v":2},7,3,6,5,1,1,12,11,2,2,0]
["Public Education Citizen Contacts",{"$f":"OFFSET($A8,0,CurrentMonthCount-B$66,1,1)","v":{"$error":"#N/A"}},188,142,1284,260,50,8,701,1988,132,62,0]
["Smoke Detectors Provided to Public",{"$f":"OFFSET($A9,0,CurrentMonthCount-B$66,1,1)","v":{"$error":"#N/A"}},{"$error":"#N/A"},{"$error":"#N/A"},{"$error":"#N/A"},{"$error":"#N/A"},2,2,10,9,0,12,0]
["Incidents Requiring a Response",{"$f":"OFFSET($A10,0,CurrentMonthCount-B$66,1,1)","v":267},282,243,277,265,273,290,256,255,249,261,237]
["Structure Fire Incidents",{"$f":"OFFSET($A11,0,CurrentMonthCount-B$66,1,1)","v":{"$error":"#N/A"}},4,3,1,1,1,3,1,1,4,10,0]
["Fire Incidents (Non-structure)",{"$f":"OFFSET($A12,0,CurrentMonthCount-B$66,1,1)","v":{"$error":"#N/A"}},11,15,9,6,5,15,13,11,13,9,6]
["Medical Assists",{"$f":"OFFSET($A13,0,CurrentMonthCount-B$66,1,1)","v":169},190,165,208,163,165,181,168,187,160,187,164]
["False Alarms",{"$f":"OFFSET($A14,0,CurrentMonthCount-B$66,1,1)","v":15},14,11,11,16,22,19,13,7,13,10,17]
["Other Calls",{"$f":"OFFSET($A15,0,CurrentMonthCount-B$66,1,1)","v":52},63,49,48,78,80,72,61,49,59,45,50]
["Mutual/Automatic Aid Given",{"$f":"OFFSET($A16,0,CurrentMonthCount-B$66,1,1)","v":27},26,19,28,26,22,17,20,19,19,22,18]
["Mutual/Automatic Aid Received",{"$f":"OFFSET($A17,0,CurrentMonthCount-B$66,1,1)","v":10},2,4,1,2,2,5,2,1,3,2,3]
["Bartow 911 Response Time (PSAP, Top Priority Calls)",{"$f":"OFFSET($A18,0,CurrentMonthCount-B$66,1,1)","v":{"$error":"#N/A"}},{"$error":"#N/A"},{"$error":"#N/A"},{"$error":"#N/A"},{"$error":"#N/A"},147,148,151,161,152,159,151]
["Turnout Time (Top Priority Calls)",{"$f":"OFFSET($A19,0,CurrentMonthCount-B$66,1,1)","v":{"$error":"#N/A"}},{"$error":"#N/A"},{"$error":"#N/A"},{"$error":"#N/A"},{"$error":"#N/A"},56,74,57,71,61,69,56]
["Response Time (Top Priority Calls)",{"$f":"OFFSET($A20,0,CurrentMonthCount-B$66,1,1)","v":{"$error":"#N/A"}},{"$error":"#N/A"},{"$error":"#N/A"},{"$error":"#N/A"},{"$error":"#N/A"},200,228,247,213,217,241,235]
["% of Top Priority Calls with Response Time of < 5 Mins",{"$f":"OFFSET($A21,0,CurrentMonthCount-B$66,1,1)","v":0.66},0.66,0.69,0.7,0.9,0.74199999999999999,0.66200000000000003,0.67900000000000005,0.68,0.6,0.70399999999999996,0.7]
["Structure Fires Contained to Room of Origin",{"$f":"OFFSET($A22,0,CurrentMonthCount-B$66,1,1)","v":{"$error":"#N/A"}},3,2,1,1,1,3,1,1,3,7,0]
["Dollar Amount of Fire Damage Loss",{"$f":"OFFSET($A23,0,CurrentMonthCount-B$66,1,1)","v":15000},320175,54150,3000,500,25000,40600,9700,2250,46000,146820,5100]
["Dollar Amount of Fire Damage Saved",{"$f":"OFFSET($A24,0,CurrentMonthCount-B$66,1,1)","v":{"$error":"#N/A"}},713500,403000,{"$error":"#N/A"},{"$error":"#N/A"},325000,288800,2550,219000,846600,2206102,762500]
["Training Hours Received",{"$f":"OFFSET($A25,0,CurrentMonthCount-B$66,1,1)","v":1927},2135,1539,1311,1574,1589,1943.5,1266.5,1628.5,944,485,1675]
["Staff Injuries",{"$f":"OFFSET($A26,0,CurrentMonthCount-B$66,1,1)","v":1},0,1,0,0,1,0,0,0,0,0,0]
[]
[]
[]
[]
[]
[]
[]
[]
[]
[]
["Pictures"]
[]
[]
["Santa pays a visit to Fire Station #1 during the Fire Station Open House event held in December."]
[]
[]
[]
[]
[]
[]
[]
[]
[]
[]
[]
[]
[]
[]
[]
[]
["The Fire Department responded to a strucuture fire in downtown Cartersville."]

{"sheet":"Parks","index":11,"n_rows":12,"n_cols":9,"rows_kept":12,"cut":false,"hidden":false,"merged":[]}
[{"$f":"CurrentMonth","v":"2012-01-01"},null,null,null,"PARKS & RECREATION"]
[]
["Participation","Last 12 Months","Fiscal Year to Date","FYTD",null,"Funding","Last 12 Months","Fiscal Year to Date","FYTD"]
[{"$f":"'Parks Data'!A8","v":"Registered Program Participants (Youth)"},null,null,{"$f":"'Parks Data'!I44","v":1237},null,{"$f":"'Parks Data'!A42","v":"Grants Awarded"},null,null,{"$f":"'Parks Data'!I42","v":0}]
[{"$f":"'Parks Data'!A9","v":"Registered Program Participants (Adult)"},null,null,{"$f":"'Parks Data'!I45","v":731}]
[{"$f":"'Parks Data'!A10","v":"Hours of Program Participation (Youth)"},null,null,{"$f":"'Parks Data'!I46","v":67009},null,"Safety"]
[{"$f":"'Parks Data'!A11","v":"Hours of Program Participation (Adult)"},null,null,{"$f":"'Parks Data'!I47","v":17895.5},null,{"$f":"'Parks Data'!A49","v":"Staff Injuries (Parks)"},null,null,{"$f":"'Parks Data'!I49","v":0}]
[{"$f":"'Parks Data'!A12","v":"Volunteer Hours Worked"},null,null,{"$f":"'Parks Data'!I48","v":5995.25},null,{"$f":"'Parks Data'!A50","v":"Crimes Reported on Park Property"},null,null,{"$f":"'Parks Data'!I50","v":12}]
[null,null,null,null,null,{"$f":"'Parks Data'!A51","v":"Documented Participant Injuries"},null,null,{"$f":"'Parks Data'!I51","v":37}]
["Events and Rentals"]
[{"$f":"'Parks Data'!A5","v":"Special Events Conducted/ Hosted/Sponsored"},null,null,{"$f":"'Parks Data'!I41","v":27}]
[{"$f":"'Parks Data'!A7","v":"Facility Rentals"},null,null,{"$f":"'Parks Data'!I43","v":262}]

{"sheet":"Parks Data","index":12,"n_rows":110,"n_cols":44,"rows_kept":110,"cut":false,"hidden":false,"merged":[]}
["Parks Data"]
[]
[]
["Measure","2008-07-01","2008-08-01","2008-09-01","2008-10-01","2008-11-01","2008-12-01","2009-01-01","2009-02-01","2009-03-01","2009-04-01","2009-05-01","2009-06-01","2009-07-01","2009-08-01","2009-09-01","2009-10-01","2009-11-01","2009-12-01","2010-01-01","2010-02-01","2010-03-01","2010-04-01","2010-05-01","2010-06-01","2010-07-01","2010-08-01","2010-09-01","2010-10-01","2010-11-01","2010-12-01","2011-01-01","2011-02-01","2011-03-01","2011-04-01","2011-05-01","2011-06-01","2011-07-01","2011-08-01","2011-09-01","2011-10-01","2011-11-01","2011-12-01","2012-01-01"]
["Special Events Conducted/ Hosted/Sponsored",{"$error":"#N/A"},{"$error":"#N/A"},{"$error":"#N/A"},{"$error":"#N/A"},{"$error":"#N/A"},{"$error":"#N/A"},{"$error":"#N/A"},{"$error":"#N/A"},{"$error":"#N/A"},{"$error":"#N/A"},{"$error":"#N/A"},{"$error":"#N/A"},{"$error":"#N/A"},{"$error":"#N/A"},{"$error":"#N/A"},{"$error":"#N/A"},{"$error":"#N/A"},{"$error":"#N/A"},0,2,0,5,2,1,5,3,6,2,2,3,0,4,2,8,7,6,6,1,2,9,6,2,1]
["Grants Awarded",{"$error":"#N/A"},{"$error":"#N/A"},{"$error":"#N/A"},{"$error":"#N/A"},{"$error":"#N/A"},{"$error":"#N/A"},{"$error":"#N/A"},{"$error":"#N/A"},{"$error":"#N/A"},{"$error":"#N/A"},{"$error":"#N/A"},{"$error":"#N/A"},{"$error":"#N/A"},{"$error":"#N/A"},{"$error":"#N/A"},{"$error":"#N/A"},{"$error":"#N/A"},{"$error":"#N/A"},{"$error":"#N/A"},{"$error":"#N/A"},{"$error":"#N/A"},{"$error":"#N/A"},{"$error":"#N/A"},{"$error":"#N/A"},{"$error":"#N/A"},{"$error":"#N/A"},{"$error":"#N/A"},{"$error":"#N/A"},{"$error":"#N/A"},{"$error":"#N/A"},{"$error":"#N/A"},{"$error":"#N/A"},{"$error":"#N/A"},{"$error":"#N/A"},{"$error":"#N/A"},{"$error":"#N/A"},0,0,0,0,0,0,0]
["Facility Rentals",{"$error":"#N/A"},{"$error":"#N/A"},{"$error":"#N/A"},{"$error":"#N/A"},{"$error":"#N/A"},{"$error":"#N/A"},{"$error":"#N/A"},{"$error":"#N/A"},{"$error":"#N/A"},{"$error":"#N/A"},{"$error":"#N/A"},{"$error":"#N/A"},{"$error":"#N/A"},{"$error":"#N/A"},{"$error":"#N/A"},{"$error":"#N/A"},{"$error":"#N/A"},{"$error":"#N/A"},{"$error":"#N/A"},{"$error":"#N/A"},{"$error":"#N/A"},{"$error":"#N/A"},{"$error":"#N/A"},{"$error":"#N/A"},{"$error":"#N/A"},{"$error":"#N/A"},{"$error":"#N/A"},{"$error":"#N/A"},{"$error":"#N/A"},{"$error":"#N/A"},{"$error":"#N/A"},{"$error":"#N/A"},{"$error":"#N/A"},{"$error":"#N/A"},{"$error":"#N/A"},{"$error":"#N/A"},44,52,54,42,27,21,22]
["Registered Program Participants (Youth)",{"$error":"#N/A"},{"$error":"#N/A"},{"$error":"#N/A"},{"$error":"#N/A"},{"$error":"#N/A"},{"$error":"#N/A"},{"$error":"#N/A"},{"$error":"#N/A"},{"$error":"#N/A"},{"$error":"#N/A"},{"$error":"#N/A"},{"$error":"#N/A"},{"$error":"#N/A"},{"$error":"#N/A"},{"$error":"#N/A"},{"$error":"#N/A"},{"$error":"#N/A"},{"$error":"#N/A"},{"$error":"#N/A"},{"$error":"#N/A"},{"$error":"#N/A"},{"$error":"#N/A"},{"$error":"#N/A"},{"$error":"#N/A"},{"$error":"#N/A"},{"$error":"#N/A"},{"$error":"#N/A"},{"$error":"#N/A"},{"$error":"#N/A"},{"$error":"#N/A"},{"$error":"#N/A"},{"$error":"#N/A"},{"$error":"#N/A"},{"$error":"#N/A"},{"$error":"#N/A"},{"$error":"#N/A"},529,293,46,76,245,16,32]
["Registered Program Participants (Adult)",{"$error":"#N/A"},{"$error":"#N/A"},{"$error":"#N/A"},{"$error":"#N/A"},{"$error":"#N/A"},{"$error":"#N/A"},{"$error":"#N/A"},{"$error":"#N/A"},{"$error":"#N/A"},{"$error":"#N/A"},{"$error":"#N/A"},{"$error":"#N/A"},{"$error":"#N/A"},{"$error":"#N/A"},{"$error":"#N/A"},{"$error":"#N/A"},{"$error":"#N/A"},{"$error":"#N/A"},{"$error":"#N/A"},{"$error":"#N/A"},{"$error":"#N/A"},{"$error":"#N/A"},{"$error":"#N/A"},{"$error":"#N/A"},{"$error":"#N/A"},{"$error":"#N/A"},{"$error":"#N/A"},{"$error":"#N/A"},{"$error":"#N/A"},{"$error":"#N/A"},{"$error":"#N/A"},{"$error":"#N/A"},{"$error":"#N/A"},{"$error":"#N/A"},{"$error":"#N/A"},{"$error":"#N/A"},144,132,225,41,0,170,19]
["Hours of Program Participation (Youth)",{"$error":"#N/A"},{"$error":"#N/A"},{"$error":"#N/A"},{"$error":"#N/A"},{"$error":"#N/A"},{"$error":"#N/A"},{"$error":"#N/A"},{"$error":"#N/A"},{"$error":"#N/A"},{"$error":"#N/A"},{"$error":"#N/A"},{"$error":"#N/A"},{"$error":"#N/A"},{"$error":"#N/A"},{"$error":"#N/A"},{"$error":"#N/A"},{"$error":"#N/A"},{"$error":"#N/A"},7170,4468.75,{"$error":"#N/A"},14666.5,6520,15516.25,17375,8675,20884.75,11156.25,11156.25,6364.25,3832.75,5817.25,4450,4626.5,4744,4331.25,5006.25,7410,14251.5,11831.75,11487.25,7591.25,9431]
["Hours of Program Participation (Adult)",{"$error":"#N/A"},{"$error":"#N/A"},{"$error":"#N/A"},{"$error":"#N/A"},{"$error":"#N/A"},{"$error":"#N/A"},{"$error":"#N/A"},{"$error":"#N/A"},{"$error":"#N/A"},{"$error":"#N/A"},{"$error":"#N/A"},{"$error":"#N/A"},{"$error":"#N/A"},{"$error":"#N/A"},{"$error":"#N/A"},{"$error":"#N/A"},{"$error":"#N/A"},{"$error":"#N/A"},2518,212,{"$error":"#N/A"},4350,5334.5,1284,708,2736.5,1441.5,2472.5,2472.5,489,1231,1450,2593,3737,4122,1741,1286.5,1532,3701,3872,2855,2628,2021]
["Volunteer Hours Worked",{"$error":"#N/A"},{"$error":"#N/A"},{"$error":"#N/A"},{"$error":"#N/A"},{"$error":"#N/A"},{"$error":"#N/A"},{"$error":"#N/A"},{"$error":"#N/A"},{"$error":"#N/A"},{"$error":"#N/A"},{"$error":"#N/A"},{"$error":"#N/A"},{"$error":"#N/A"},{"$error":"#N/A"},{"$error":"#N/A"},{"$error":"#N/A"},{"$error":"#N/A"},{"$error":"#N/A"},840,365,1022.5,787.25,776,818,449,1421.5,1599.25,1228.25,1228.25,823,684.25,427.25,855.25,4803,478.5,645,435.5,620.25,1295.5,1030,1111.5,818.5,684]
["Staff Injuries (Parks)",{"$error":"#N/A"},{"$error":"#N/A"},{"$error":"#N/A"},{"$error":"#N/A"},{"$error":"#N/A"},{"$error":"#N/A"},{"$error":"#N/A"},{"$error":"#N/A"},{"$error":"#N/A"},{"$error":"#N/A"},{"$error":"#N/A"},{"$error":"#N/A"},{"$error":"#N/A"},{"$error":"#N/A"},{"$error":"#N/A"},{"$error":"#N/A"},{"$error":"#N/A"},{"$error":"#N/A"},1,2,0,0,0,4,0,0,0,0,0,0,0,0,0,0,0,1,0,0,0,0,0,0,0]
["Crimes Reported on Park Property",{"$error":"#N/A"},{"$error":"#N/A"},{"$error":"#N/A"},{"$error":"#N/A"},{"$error":"#N/A"},{"$error":"#N/A"},{"$error":"#N/A"},{"$error":"#N/A"},{"$error":"#N/A"},{"$error":"#N/A"},{"$error":"#N/A"},{"$error":"#N/A"},{"$error":"#N/A"},{"$error":"#N/A"},{"$error":"#N/A"},{"$error":"#N/A"},{"$error":"#N/A"},{"$error":"#N/A"},0,2,1,0,0,3,0,0,2,3,3,2,1,0,7,2,5,3,0,0,2,8,2,0,0]
["Documented Participant Injuries",{"$error":"#N/A"},{"$error":"#N/A"},{"$error":"#N/A"},{"$error":"#N/A"},{"$error":"#N/A"},{"$error":"#N/A"},{"$error":"#N/A"},{"$error":"#N/A"},{"$error":"#N/A"},{"$error":"#N/A"},{"$error":"#N/A"},{"$error":"#N/A"},{"$error":"#N/A"},{"$error":"#N/A"},{"$error":"#N/A"},{"$error":"#N/A"},{"$error":"#N/A"},{"$error":"#N/A"},2,0,0,3,5,28,13,1,4,1,1,2,0,0,1,2,11,27,19,10,2,4,1,0,1]
[]
[]
[]
[]
[]
[]
[]
[]
[]
[]
[]
["HIGHLIGHTS","2008-07-01","2008-08-01","2008-09-01","2008-10-01","2008-11-01","2008-12-01","2009-01-01","2009-02-01","2009-03-01","2009-04-01","2009-05-01","2009-06-01","2009-07-01","2009-08-01","2009-09-01","2009-10-01","2009-11-01","2009-12-01","2010-01-01","2010-02-01","2010-03-01","2010-04-01","2010-05-01","2010-06-01","2010-07-01","2010-08-01","2010-09-01","2010-10-01","2010-11-01","2010-12-01","2011-01-01","2011-02-01","2011-03-01","2011-04-01","2011-05-01","2011-06-01","2011-07-01","2011-08-01","2011-09-01","2011-10-01","2011-11-01","2011-12-01","2012-01-01"]
["Highlight 1",null,null,null,null,null,null,null,null,null,null,null,null,null,null,null,null,null,null,null,null,null,null,null,null,null,null,null,null,null,null,null,null,null,null,null,null,null,"1. Set a new record for attendance of the monthly \"Moonlight Hike\" with over 100 participants.","1.  Hosted Pioneer Days from September 2nd through the 5th (3rd Year).  Attendance was good on Friday and Saturday, however, Sunday's attendance was lower than expected.  Due to rain, fireworks and activities on Monday were cancelled.","Hosted several special events including Football Youth Night at Cartersville High School, Outdoor Movie Night, October Moonlight Hike, Gymnastics Exhibition and Open Lessons at the Library, Girl Scout Party, and the 8u, 10u, and 12u Football Challenge.","Hosted the Halloween Festival on October 29th, with approximately 1,500 in attendance.","December 3-4: hosted Boys Gymnastics Meet approx 200 participants ","SAC was closed Dec 31 - Jan 2, Jan 16, closed early Jan 23 & 28 (weather).  1,078 sign-ins at the SAC of those 1,020 participated in classes"]
["Highlight 2",null,null,null,null,null,null,null,null,null,null,null,null,null,null,null,null,null,null,null,null,null,null,null,null,null,null,null,null,null,null,null,null,null,null,null,null,null,"2. Andre Fluellen Football Camp held in partnership with the Cartersville Parks and Recreation Department.","2.  Hosted another successful Moonlight Hike on Pine Mountain on September 12th.","Registered 76 youth participants for basketball.","Held the Nifty November Gymnastics Meet from November 4th - 6th, with 310 participants attending.","December 10: Youth Basketball season began with 11 games in, program consist of 30 teams","Adult Basketball Season began "]
["Highlight 3",null,null,null,null,null,null,null,null,null,null,null,null,null,null,null,null,null,null,null,null,null,null,null,null,null,null,null,null,null,null,null,null,null,null,null,null,null,null,"3.  Hosted a fishing event at Dellinger Park Lake for National Hunting and Fishing Day on September 24th.","There were seven \"smash and grab\" robberies on park property during the month of October.","During the week of November 14th through 19th, CPRD hosted the GRPA 5th District Youth Football Tournament.","December 10: Pine Mountain Moonlight hike",{"$f":"\"Gymnastics competed in 5 meets:\"&CHAR(10)&\"     Level 3 girls: 1st place team, 4 all around & 14 individual event champions\" & CHAR(10) & \"     Level 4-10 boys: Level 4: 2nd place team, 1 all around & 10 individual event champions\" & CHAR(10) & \"     Level 7-10 girls: Level 8: 1st place team, Level 7: 3rd place team, 7 individual event champions\" & CHAR(10) & \"     Level 5-10 boys: Level 5: 1st place team, 3 all around, 12 individula event champions\"","v":"Gymnastics competed in 5 meets:\n     Level 3 girls: 1st place team, 4 all around & 14 individual event champions\n     Level 4-10 boys: Level 4: 2nd place team, 1 all around & 10 individual event champions\n     Level 7-10 girls: Level 8: 1st place team, Level 7: 3rd place team, 7 individual event champions\n     Level 5-10 boys: Level 5: 1st place team, 3 all around, 12 individula event champions"}]
["Highlight 4",null,null,null,null,null,null,null,null,null,null,null,null,null,null,null,null,null,null,null,null,null,null,null,null,null,null,null,null,null,null,null,null,null,null,null,null,null,null,"4.  Started Fall Football and Cheerleading programs.",null,"On November 19th, Sam Smith Park hosted the United Way for Bartow County \"Turkey Trot\" Road Race with 295 runners participating.","December 21: Pine Mountain Winter Solstice Hikes: 3 participants for the morning/evening hikes (weather was rainy & cold)","Tennis: Cartersville High School, Cartersville Middle School & Excel Christian Academy started practice during January in addition to EVTA & CPRD classes leaving 2 courts available to the public during prime afternoon/evening hours"]
["Highlight 5",null,null,null,null,null,null,null,null,null,null,null,null,null,null,null,null,null,null,null,null,null,null,null,null,null,null,null,null,null,null,null,null,null,null,null,null,null,null,"5.  Began construction on Phase II of the Pettit Creek Trail.",null,"The Youth Basketball Program began the week of November 14th.",null,"Cartersville Little League & Cartersville-Bartow Youth Soccer Association (CBYSA) began registration; soccer takes all their registrations online"]
["Highlight 6",null,null,null,null,null,null,null,null,null,null,null,null,null,null,null,null,null,null,null,null,null,null,null,null,null,null,null,null,null,null,null,null,null,null,null,null,null,null,null,null,"The Cartersville Civic Center hosted two Feed the Community meals: \"Feed the Community,\" sponsored by New Frontier Club on November 19th and \"Feed the Hungry,\" sponsored by Creekside Fellowship on November 23rd.",null,"CPRD hosted the Georgia Recreation & Parks Association (GRPA) 5th District Athletic Meeting"]
["Highlight 7",null,null,null,null,null,null,null,null,null,null,null,null,null,null,null,null,null,null,null,null,null,null,null,null,null,null,null,null,null,null,null,null,null,null,null,null,null,null,null,null,null,null,"Challenger Basketball (3 teams & 1 cheer) began in January for special needs children (ages 4-12). This is the first time in several years that this program has been offered."]
["Highlight 8"]
["Highlights Concaetenation",{"$f":"B28&CHAR(10)&CHAR(10)&B29&CHAR(10)&CHAR(10)&B30&CHAR(10)&CHAR(10)&B31&CHAR(10)&CHAR(10)&B32&CHAR(10)&CHAR(10)&B33&CHAR(10)&CHAR(10)&B34&CHAR(10)&CHAR(10)&B35","v":"\n\n\n\n\n\n\n\n\n\n\n\n\n\n"},"\n\n\n\n\n\n\n\n\n\n\n\n\n\n","\n\n\n\n\n\n\n\n\n\n\n\n\n\n","\n\n\n\n\n\n\n\n\n\n\n\n\n\n","\n\n\n\n\n\n\n\n\n\n\n\n\n\n","\n\n\n\n\n\n\n\n\n\n\n\n\n\n","\n\n\n\n\n\n\n\n\n\n\n\n\n\n","\n\n\n\n\n\n\n\n\n\n\n\n\n\n","\n\n\n\n\n\n\n\n\n\n\n\n\n\n","\n\n\n\n\n\n\n\n\n\n\n\n\n\n","\n\n\n\n\n\n\n\n\n\n\n\n\n\n","\n\n\n\n\n\n\n\n\n\n\n\n\n\n","\n\n\n\n\n\n\n\n\n\n\n\n\n\n","\n\n\n\n\n\n\n\n\n\n\n\n\n\n","\n\n\n\n\n\n\n\n\n\n\n\n\n\n","\n\n\n\n\n\n\n\n\n\n\n\n\n\n","\n\n\n\n\n\n\n\n\n\n\n\n\n\n","\n\n\n\n\n\n\n\n\n\n\n\n\n\n","\n\n\n\n\n\n\n\n\n\n\n\n\n\n","\n\n\n\n\n\n\n\n\n\n\n\n\n\n","\n\n\n\n\n\n\n\n\n\n\n\n\n\n","\n\n\n\n\n\n\n\n\n\n\n\n\n\n","\n\n\n\n\n\n\n\n\n\n\n\n\n\n","\n\n\n\n\n\n\n\n\n\n\n\n\n\n","\n\n\n\n\n\n\n\n\n\n\n\n\n\n","\n\n\n\n\n\n\n\n\n\n\n\n\n\n","\n\n\n\n\n\n\n\n\n\n\n\n\n\n","\n\n\n\n\n\n\n\n\n\n\n\n\n\n","\n\n\n\n\n\n\n\n\n\n\n\n\n\n","\n\n\n\n\n\n\n\n\n\n\n\n\n\n","\n\n\n\n\n\n\n\n\n\n\n\n\n\n","\n\n\n\n\n\n\n\n\n\n\n\n\n\n","\n\n\n\n\n\n\n\n\n\n\n\n\n\n","\n\n\n\n\n\n\n\n\n\n\n\n\n\n","\n\n\n\n\n\n\n\n\n\n\n\n\n\n","\n\n\n\n\n\n\n\n\n\n\n\n\n\n","\n\n\n\n\n\n\n\n\n\n\n\n\n\n","1. Set a new record for attendance of the monthly \"Moonlight Hike\" with over 100 participants.\n\n2. Andre Fluellen Football Camp held in partnership with the Cartersville Parks and Recreation Department.\n\n\n\n\n\n\n\n\n\n\n\n",{"$f":"AN28&CHAR(10)&CHAR(10)&AN29&CHAR(10)&CHAR(10)&AN30&CHAR(10)&CHAR(10)&AN31&CHAR(10)&CHAR(10)&AN32&CHAR(10)&CHAR(10)&AN33&CHAR(10)&CHAR(10)&AN34&CHAR(10)&CHAR(10)&AN35","v":"1.  Hosted Pioneer Days from September 2nd through the 5th (3rd Year).  Attendance was good on Friday and Saturday, however, Sunday's attendance was lower than expected.  Due to rain, fireworks and activities on Monday were cancelled.\n\n2.  Hosted another successful Moonlight Hike on Pine Mountain on September 12th.\n\n3.  Hosted a fishing event at Dellinger Park Lake for National Hunting and Fishing Day on September 24th.\n\n4.  Started Fall Football and Cheerleading programs.\n\n5.  Began construction on Phase II of the Pettit Creek Trail.\n\n\n\n\n\n"},{"$f":"AO28&CHAR(10)&CHAR(10)&AO29&CHAR(10)&CHAR(10)&AO30&CHAR(10)&CHAR(10)&AO31&CHAR(10)&CHAR(10)&AO32&CHAR(10)&CHAR(10)&AO33&CHAR(10)&CHAR(10)&AO34&CHAR(10)&CHAR(10)&AO35","v":"Hosted several special events including Football Youth Night at Cartersville High School, Outdoor Movie Night, October Moonlight Hike, Gymnastics Exhibition and Open Lessons at the Library, Girl Scout Party, and the 8u, 10u, and 12u Football Challenge.\n\nRegistered 76 youth participants for basketball.\n\nThere were seven \"smash and grab\" robberies on park property during the month of October.\n\n\n\n\n\n\n\n\n\n"},"Hosted the Halloween Festival on October 29th, with approximately 1,500 in attendance.\n\nHeld the Nifty November Gymnastics Meet from November 4th - 6th, with 310 participants attending.\n\nDuring the week of November 14th through 19th, CPRD hosted the GRPA 5th District Youth Football Tournament.\n\nOn November 19th, Sam Smith Park hosted the United Way for Bartow County \"Turkey Trot\" Road Race with 295 runners participating.\n\nThe Youth Basketball Program began the week of November 14th.\n\nThe Cartersville Civic Center hosted two Feed the Community meals: \"Feed the Community,\" sponsored by New Frontier Club on November 19th and \"Feed the Hungry,\" sponsored by Creekside Fellowship on November 23rd.\n\n\n\n","December 3-4: hosted Boys Gymnastics Meet approx 200 participants \n\nDecember 10: Youth Basketball season began with 11 games in, program consist of 30 teams\n\nDecember 10: Pine Mountain Moonlight hike\n\nDecember 21: Pine Mountain Winter Solstice Hikes: 3 participants for the morning/evening hikes (weather was rainy & cold)\n\n\n\n\n\n\n\n","SAC was closed Dec 31 - Jan 2, Jan 16, closed early Jan 23 & 28 (weather).  1,078 sign-ins at the SAC of those 1,020 participated in classes\n\nAdult Basketball Season began \n\nGymnastics competed in 5 meets:\n     Level 3 girls: 1st place team, 4 all around & 14 individual event champions\n     Level 4-10 boys: Level 4: 2nd place team, 1 all around & 10 individual event champions\n     Level 7-10 girls: Level 8: 1st place team, Level 7: 3rd place team, 7 individual event champions\n     Level 5-10 boys: Level 5: 1st place team, 3 all around, 12 individula event champions\n\nTennis: Cartersville High School, Cartersville Middle School & Excel Christian Academy started practice during January in addition to EVTA & CPRD classes leaving 2 courts available to the public during prime afternoon/evening hours\n\nCartersville Little League & Cartersville-Bartow Youth Soccer Association (CBYSA) began registration; soccer takes all their registrations online\n\nCPRD hosted the Georgia Recreation & Parks Association (GRPA) 5th District Athletic Meeting\n\nChallenger Basketball (3 teams & 1 cheer) began in January for special needs children (ages 4-12). This is the first time in several years that this program has been offered.\n\n"]
[]
[]
[]
["Bullet Chart Source","Target","What's Better?","Band 1","Band 2","YTD Type","Max Scale","Actual 1","Actual","Actual 3","Projection 1","Projection 2","Projection 3","First Zone 1","First Zone 2","First Zone 3","Second Zone 1","Second Zone 2","Second Zone 3","Previous X 1","Previous X 2","Previous Y 1","Previous Y 2"]
[{"$f":"A5","v":"Special Events Conducted/ Hosted/Sponsored"},78,"More",0.85,1,"Sum",{"$f":"ROUNDUP((ROUNDUP(MAX(B41,SUM(I41,L41)),-LEN(EVEN(MAX(B41,SUM(I41,L41))))+2)/5),-LEN(EVEN(ROUNDUP(MAX(B41,SUM(I41,L41)),-LEN(EVEN(MAX(B41,SUM(I41,L41))))+2)/5))+1)*5","v":100},0,{"$f":"IF(F41=\"Sum\",SUM(OFFSET(A5,0,YTDBeg,1,YTDWidth)),AVERAGE(OFFSET(A5,0,YTDBeg,1,YTDWidth)))","v":27},0,0,{"$f":"IF(F41=\"Sum\",Projection*(I41/YTDWidth*12-I41),0)","v":0},0,{"$f":"B41*D41","v":66.3},{"$f":"((I41+L41<=N41)*(N41-(I41+L41)))","v":39.299999999999997},{"$f":"N41","v":66.3},{"$f":"(E41-D41)*B41","v":11.700000000000001},{"$f":"((I41+L41<=N41+Q41)*((N41+Q41)-(I41+L41+O41)))","v":11.700000000000003},{"$f":"Q41","v":11.700000000000001},{"$f":"IF(F41=\"Sum\",SUM(OFFSET(A5,0,YTDBeg-12,1,YTDWidth)),AVERAGE(OFFSET(A5,0,YTDBeg-12,1,YTDWidth)))","v":21},{"$f":"T41","v":21},1,2]
[{"$f":"A6","v":"Grants Awarded"},2,"More",0.85,1,"Sum",{"$f":"ROUNDUP((ROUNDUP(MAX(B42,SUM(I42,L42)),-LEN(EVEN(MAX(B42,SUM(I42,L42))))+2)/5),-LEN(EVEN(ROUNDUP(MAX(B42,SUM(I42,L42)),-LEN(EVEN(MAX(B42,SUM(I42,L42))))+2)/5))+1)*5","v":5},0,0,0,0,0,0,1.7,{"$f":"((I42+L42<=N42)*(N42-(I42+L42)))","v":1.7},{"$f":"N42","v":1.7},0.30000000000000004,{"$f":"((I42+L42<=N42+Q42)*((N42+Q42)-(I42+L42+O42)))","v":0.30000000000000004},{"$f":"Q42","v":0.30000000000000004},{"$error":"#N/A"},{"$f":"T42","v":{"$error":"#N/A"}},1,2]
["Facility Rentals",1150,"More",0.85,1,"Sum",{"$f":"ROUNDUP((ROUNDUP(MAX(B43,SUM(I43,L43)),-LEN(EVEN(MAX(B43,SUM(I43,L43))))+2)/5),-LEN(EVEN(ROUNDUP(MAX(B43,SUM(I43,L43)),-LEN(EVEN(MAX(B43,SUM(I43,L43))))+2)/5))+1)*5","v":1500},0,262,0,0,0,0,977.5,715.5,977.5,172.50000000000003,172.5,172.50000000000003,{"$error":"#N/A"},{"$error":"#N/A"},1,2]
["Registered Program Participants (Youth)",2700,"More",0.85,1,"Sum",3000,0,1237,0,0,0,0,2295,1058,2295,405.00000000000006,405,405.00000000000006,{"$error":"#N/A"},{"$error":"#N/A"},1,2]
["Registered Program Participants (Adult)",1200,"More",0.85,1,"Sum",1500,0,731,0,0,0,0,1020,289,1020,180.00000000000003,180,180.00000000000003,{"$error":"#N/A"},{"$error":"#N/A"},1,2]
["Hours of Program Participation (Youth)",135500,"More",0.85,1,"Sum",150000,0,67009,0,0,0,0,115175,48166,115175,20325.000000000004,20325,20325.000000000004,79444.25,79444.25,1,2]
["Hours of Program Participation (Adult)",26500,"More",0.85,1,"Sum",30000,0,17895.5,0,0,0,0,22525,4629.5,22525,3975.0000000000005,3975,3975.0000000000005,11551,11551,1,2]
["Volunteer Hours Worked",11500,"More",0.85,1,"Sum",15000,0,5995.25,0,0,0,0,9775,3779.75,9775,1725.0000000000002,1725,1725.0000000000002,7433.5,7433.5,1,2]
["Staff Injuries (Parks)",0,"Less",1,1.1499999999999999,"Sum",0,0,0,0,0,0,0,0,0,0,0,0,0,0,0,1,2]
["Crimes Reported on Park Property",10,"Less",1,1.1499999999999999,"Sum",15,0,12,0,0,0,0,10,0,10,1.4999999999999991,0,1.4999999999999991,11,11,1,2]
["Documented Participant Injuries",10,"Less",1,1.1499999999999999,"Sum",40,0,37,0,0,0,0,10,0,10,1.4999999999999991,0,1.4999999999999991,22,22,1,2]
[]
[]
[]
[]
[]
[]
[]
[]
[]
[]
[]
[]
[]
["SPARKLINE SOURCE"]
[null,11,10,9,8,7,6,5,4,3,2,1,0]
["Measure",{"$f":"OFFSET($A4,0,CurrentMonthCount-B$66,1,1)","v":"2011-02-01"},"2011-03-01","2011-04-01","2011-05-01","2011-06-01","2011-07-01","2011-08-01","2011-09-01","2011-10-01","2011-11-01","2011-12-01","2012-01-01"]
[{"$f":"A5","v":"Special Events Conducted/ Hosted/Sponsored"},{"$f":"OFFSET($A5,0,CurrentMonthCount-B$66,1,1)","v":4},2,8,7,6,6,1,2,9,6,2,1]
[{"$f":"A6","v":"Grants Awarded"},{"$f":"OFFSET($A6,0,CurrentMonthCount-B$66,1,1)","v":{"$error":"#N/A"}},{"$error":"#N/A"},{"$error":"#N/A"},{"$error":"#N/A"},{"$error":"#N/A"},0,0,0,0,0,0,0]
["Facility Rentals",{"$f":"OFFSET($A7,0,CurrentMonthCount-B$66,1,1)","v":{"$error":"#N/A"}},{"$error":"#N/A"},{"$error":"#N/A"},{"$error":"#N/A"},{"$error":"#N/A"},44,52,54,42,27,21,22]
["Registered Program Participants (Youth)",{"$f":"OFFSET($A8,0,CurrentMonthCount-B$66,1,1)","v":{"$error":"#N/A"}},{"$error":"#N/A"},{"$error":"#N/A"},{"$error":"#N/A"},{"$error":"#N/A"},529,293,46,76,245,16,32]
["Registered Program Participants (Adult)",{"$f":"OFFSET($A9,0,CurrentMonthCount-B$66,1,1)","v":{"$error":"#N/A"}},{"$error":"#N/A"},{"$error":"#N/A"},{"$error":"#N/A"},{"$error":"#N/A"},144,132,225,41,0,170,19]
["Hours of Program Participation (Youth)",{"$f":"OFFSET($A10,0,CurrentMonthCount-B$66,1,1)","v":5817.25},4450,4626.5,4744,4331.25,5006.25,7410,14251.5,11831.75,11487.25,7591.25,9431]
["Hours of Program Participation (Adult)",{"$f":"OFFSET($A11,0,CurrentMonthCount-B$66,1,1)","v":1450},2593,3737,4122,1741,1286.5,1532,3701,3872,2855,2628,2021]
["Volunteer Hours Worked",{"$f":"OFFSET($A12,0,CurrentMonthCount-B$66,1,1)","v":427.25},855.25,4803,478.5,645,435.5,620.25,1295.5,1030,1111.5,818.5,684]
["Staff Injuries (Parks)",{"$f":"OFFSET($A13,0,CurrentMonthCount-B$66,1,1)","v":0},0,0,0,1,0,0,0,0,0,0,0]
["Crimes Reported on Park Property",{"$f":"OFFSET($A14,0,CurrentMonthCount-B$66,1,1)","v":0},7,2,5,3,0,0,2,8,2,0,0]
["Documented Participant Injuries",{"$f":"OFFSET($A15,0,CurrentMonthCount-B$66,1,1)","v":0},1,2,11,27,19,10,2,4,1,0,1]
[0,{"$f":"OFFSET($A16,0,CurrentMonthCount-B$66,1,1)","v":0},0,0,0,0,0,0,0,0,0,0,0]
[0,{"$f":"OFFSET($A17,0,CurrentMonthCount-B$66,1,1)","v":0},0,0,0,0,0,0,0,0,0,0,0]
[0,{"$f":"OFFSET($A18,0,CurrentMonthCount-B$66,1,1)","v":0},0,0,0,0,0,0,0,0,0,0,0]
[0,{"$f":"OFFSET($A19,0,CurrentMonthCount-B$66,1,1)","v":0},0,0,0,0,0,0,0,0,0,0,0]
[0,{"$f":"OFFSET($A20,0,CurrentMonthCount-B$66,1,1)","v":0},0,0,0,0,0,0,0,0,0,0,0]
[0,{"$f":"OFFSET($A21,0,CurrentMonthCount-B$66,1,1)","v":0},0,0,0,0,0,0,0,0,0,0,0]
[0,{"$f":"OFFSET($A22,0,CurrentMonthCount-B$66,1,1)","v":0},0,0,0,0,0,0,0,0,0,0,0]
[0,{"$f":"OFFSET($A23,0,CurrentMonthCount-B$66,1,1)","v":0},0,0,0,0,0,0,0,0,0,0,0]
[0,{"$f":"OFFSET($A24,0,CurrentMonthCount-B$66,1,1)","v":0},0,0,0,0,0,0,0,0,0,0,0]
[]
[]
[]
[]
[]
[]
[]
["Boys basketball."]
[]
[]
[]
[]
[]
[]
[]
[]
[]
[]
[]
[]
[]
[]
["Girls basketball."]

{"sheet":"Public","index":13,"n_rows":10,"n_cols":9,"rows_kept":10,"cut":false,"hidden":false,"merged":[]}
[{"$f":"CurrentMonth","v":"2012-01-01"},null,null,null,"PUBLIC WORKS"]
[]
["Roads/Sidewalks","Last 12 Months","Fiscal Year to Date","FYTD",null,"Facilities","Last 12 Months","Fiscal Year to Date","FYTD"]
[{"$f":"'Public Data'!A5","v":"Road Maintenance Work Orders Completed"},null,null,{"$f":"'Public Data'!I41","v":304},null,{"$f":"'Public Data'!A12","v":"Tree Trimming Work Orders Completed"},null,null,{"$f":"'Public Data'!I48","v":79}]
[{"$f":"'Public Data'!A6","v":"Pot Holes Repaired"},null,null,{"$f":"'Public Data'!I42","v":68},null,{"$f":"'Public Data'!A13","v":"Landscaping Work Orders Completed"},null,null,{"$f":"'Public Data'!I49","v":20}]
[{"$f":"'Public Data'!A7","v":"Tons of Asphalt Spread"},null,null,{"$f":"'Public Data'!I43","v":107},null,{"$f":"'Public Data'!A14","v":"Facility Maintenance Work Orders Completed"},null,null,{"$f":"'Public Data'!I50","v":40}]
[{"$f":"'Public Data'!A8","v":"Utility Cuts Repaired"},null,null,{"$f":"'Public Data'!I44","v":186}]
[{"$f":"'Public Data'!A9","v":"Square Feet of Sidewalk Repaired"},null,null,{"$f":"'Public Data'!I45","v":15635},null,"Human Resources"]
[{"$f":"'Public Data'!A10","v":"Roadside Mowing (Lane Miles)"},null,null,{"$f":"'Public Data'!I46","v":458.9},null,{"$f":"'Public Data'!A15","v":"Staff Injuries (Public Works)"},null,null,{"$f":"'Public Data'!I51","v":1}]
[{"$f":"'Public Data'!A11","v":"Complaints Received About Road Conditions"},null,null,{"$f":"'Public Data'!I47","v":63}]

{"sheet":"Public Data","index":14,"n_rows":108,"n_cols":44,"rows_kept":108,"cut":false,"hidden":true,"merged":[]}
["Public Data"]
[]
[]
["Measure","2008-07-01","2008-08-01","2008-09-01","2008-10-01","2008-11-01","2008-12-01","2009-01-01","2009-02-01","2009-03-01","2009-04-01","2009-05-01","2009-06-01","2009-07-01","2009-08-01","2009-09-01","2009-10-01","2009-11-01","2009-12-01","2010-01-01","2010-02-01","2010-03-01","2010-04-01","2010-05-01","2010-06-01","2010-07-01","2010-08-01","2010-09-01","2010-10-01","2010-11-01","2010-12-01","2011-01-01","2011-02-01","2011-03-01","2011-04-01","2011-05-01","2011-06-01","2011-07-01","2011-08-01","2011-09-01","2011-10-01","2011-11-01","2011-12-01","2012-01-01"]
["Road Maintenance Work Orders Completed",{"$error":"#N/A"},{"$error":"#N/A"},{"$error":"#N/A"},{"$error":"#N/A"},{"$error":"#N/A"},{"$error":"#N/A"},{"$error":"#N/A"},{"$error":"#N/A"},{"$error":"#N/A"},{"$error":"#N/A"},{"$error":"#N/A"},{"$error":"#N/A"},{"$error":"#N/A"},{"$error":"#N/A"},{"$error":"#N/A"},{"$error":"#N/A"},{"$error":"#N/A"},18,19,10,29,24,31,36,23,25,37,79,58,42,50,53,90,72,45,43,68,54,32,54,17,38,41]
["Pot Holes Repaired",{"$error":"#N/A"},{"$error":"#N/A"},{"$error":"#N/A"},{"$error":"#N/A"},{"$error":"#N/A"},{"$error":"#N/A"},{"$error":"#N/A"},{"$error":"#N/A"},{"$error":"#N/A"},{"$error":"#N/A"},{"$error":"#N/A"},{"$error":"#N/A"},{"$error":"#N/A"},{"$error":"#N/A"},{"$error":"#N/A"},{"$error":"#N/A"},{"$error":"#N/A"},2,9,58,24,15,22,18,5,8,10,17,3,4,0,40,28,21,5,9,15,10,5,8,3,14,13]
["Tons of Asphalt Spread",{"$error":"#N/A"},{"$error":"#N/A"},{"$error":"#N/A"},{"$error":"#N/A"},{"$error":"#N/A"},{"$error":"#N/A"},{"$error":"#N/A"},{"$error":"#N/A"},{"$error":"#N/A"},{"$error":"#N/A"},{"$error":"#N/A"},{"$error":"#N/A"},{"$error":"#N/A"},{"$error":"#N/A"},{"$error":"#N/A"},{"$error":"#N/A"},{"$error":"#N/A"},10,17,52,31,34,17,17,27,13,47,18,7.08,15,13,28,39,24,5,9,16,15,21,20,8,9,18]
["Utility Cuts Repaired",{"$error":"#N/A"},{"$error":"#N/A"},{"$error":"#N/A"},{"$error":"#N/A"},{"$error":"#N/A"},{"$error":"#N/A"},{"$error":"#N/A"},{"$error":"#N/A"},{"$error":"#N/A"},{"$error":"#N/A"},{"$error":"#N/A"},{"$error":"#N/A"},{"$error":"#N/A"},{"$error":"#N/A"},{"$error":"#N/A"},{"$error":"#N/A"},{"$error":"#N/A"},17,34,16,34,39,49,40,15,30,48,48,23,7,16,64,65,22,5,20,39,30,24,31,17,8,37]
["Square Feet of Sidewalk Repaired",{"$error":"#N/A"},{"$error":"#N/A"},{"$error":"#N/A"},{"$error":"#N/A"},{"$error":"#N/A"},{"$error":"#N/A"},{"$error":"#N/A"},{"$error":"#N/A"},{"$error":"#N/A"},{"$error":"#N/A"},{"$error":"#N/A"},{"$error":"#N/A"},{"$error":"#N/A"},{"$error":"#N/A"},{"$error":"#N/A"},{"$error":"#N/A"},{"$error":"#N/A"},12,12,395,225,1633,1589,490,325,32,435,1188,954,0,1000,1400,3090,4002,1690,2995,3852,3268,2882,3412,0,1595,626]
["Roadside Mowing (Lane Miles)",{"$error":"#N/A"},{"$error":"#N/A"},{"$error":"#N/A"},{"$error":"#N/A"},{"$error":"#N/A"},{"$error":"#N/A"},{"$error":"#N/A"},{"$error":"#N/A"},{"$error":"#N/A"},{"$error":"#N/A"},{"$error":"#N/A"},{"$error":"#N/A"},{"$error":"#N/A"},{"$error":"#N/A"},{"$error":"#N/A"},{"$error":"#N/A"},{"$error":"#N/A"},{"$error":"#N/A"},{"$error":"#N/A"},{"$error":"#N/A"},{"$error":"#N/A"},{"$error":"#N/A"},{"$error":"#N/A"},{"$error":"#N/A"},{"$error":"#N/A"},{"$error":"#N/A"},{"$error":"#N/A"},{"$error":"#N/A"},{"$error":"#N/A"},{"$error":"#N/A"},{"$error":"#N/A"},{"$error":"#N/A"},{"$error":"#N/A"},{"$error":"#N/A"},{"$error":"#N/A"},{"$error":"#N/A"},113.6,108,119.3,118,0,0,0]
["Complaints Received About Road Conditions",{"$error":"#N/A"},{"$error":"#N/A"},{"$error":"#N/A"},{"$error":"#N/A"},{"$error":"#N/A"},{"$error":"#N/A"},{"$error":"#N/A"},{"$error":"#N/A"},{"$error":"#N/A"},{"$error":"#N/A"},{"$error":"#N/A"},{"$error":"#N/A"},{"$error":"#N/A"},{"$error":"#N/A"},{"$error":"#N/A"},{"$error":"#N/A"},{"$error":"#N/A"},2,4,10,4,11,13,7,8,8,5,5,11,8,2,8,6,11,12,7,13,12,12,11,4,3,8]
["Tree Trimming Work Orders Completed",{"$error":"#N/A"},{"$error":"#N/A"},{"$error":"#N/A"},{"$error":"#N/A"},{"$error":"#N/A"},{"$error":"#N/A"},{"$error":"#N/A"},{"$error":"#N/A"},{"$error":"#N/A"},{"$error":"#N/A"},{"$error":"#N/A"},{"$error":"#N/A"},{"$error":"#N/A"},{"$error":"#N/A"},{"$error":"#N/A"},{"$error":"#N/A"},{"$error":"#N/A"},5,5,10,6,12,13,15,15,16,21,9,9,11,13,9,5,6,10,15,7,21,13,8,5,12,13]
["Landscaping Work Orders Completed",{"$error":"#N/A"},{"$error":"#N/A"},{"$error":"#N/A"},{"$error":"#N/A"},{"$error":"#N/A"},{"$error":"#N/A"},{"$error":"#N/A"},{"$error":"#N/A"},{"$error":"#N/A"},{"$error":"#N/A"},{"$error":"#N/A"},{"$error":"#N/A"},{"$error":"#N/A"},{"$error":"#N/A"},{"$error":"#N/A"},{"$error":"#N/A"},{"$error":"#N/A"},2,2,6,6,2,2,6,0,4,3,11,0,0,1,4,6,8,6,1,2,1,3,4,6,2,2]
["Facility Maintenance Work Orders Completed",{"$error":"#N/A"},{"$error":"#N/A"},{"$error":"#N/A"},{"$error":"#N/A"},{"$error":"#N/A"},{"$error":"#N/A"},{"$error":"#N/A"},{"$error":"#N/A"},{"$error":"#N/A"},{"$error":"#N/A"},{"$error":"#N/A"},{"$error":"#N/A"},{"$error":"#N/A"},{"$error":"#N/A"},{"$error":"#N/A"},{"$error":"#N/A"},{"$error":"#N/A"},13,10,10,10,10,14,8,9,7,7,9,2,6,3,4,3,10,7,1,4,7,4,8,7,5,5]
["Staff Injuries (Public Works)",{"$error":"#N/A"},{"$error":"#N/A"},{"$error":"#N/A"},{"$error":"#N/A"},{"$error":"#N/A"},{"$error":"#N/A"},{"$error":"#N/A"},{"$error":"#N/A"},{"$error":"#N/A"},{"$error":"#N/A"},{"$error":"#N/A"},{"$error":"#N/A"},{"$error":"#N/A"},{"$error":"#N/A"},{"$error":"#N/A"},{"$error":"#N/A"},{"$error":"#N/A"},0,0,0,0,0,0,0,0,0,0,0,0,0,0,0,0,0,0,0,1,0,0,0,0,0]
[]
[]
[]
[]
[]
[]
[]
[]
[]
[]
[]
["HIGHLIGHTS","2008-07-01","2008-08-01","2008-09-01","2008-10-01","2008-11-01","2008-12-01","2009-01-01","2009-02-01","2009-03-01","2009-04-01","2009-05-01","2009-06-01","2009-07-01","2009-08-01","2009-09-01","2009-10-01","2009-11-01","2009-12-01","2010-01-01","2010-02-01","2010-03-01","2010-04-01","2010-05-01","2010-06-01","2010-07-01","2010-08-01","2010-09-01","2010-10-01","2010-11-01","2010-12-01","2011-01-01","2011-02-01","2011-03-01","2011-04-01","2011-05-01","2011-06-01","2011-07-01","2011-08-01","2011-09-01","2011-10-01","2011-11-01","2011-12-01","2012-01-01"]
["Highlight 1",null,null,null,null,null,null,null,null,null,null,null,null,null,null,null,null,null,null,null,null,null,null,null,null,null,null,null,null,null,null,null,null,null,null,null,null,null,null,"1.  Completed a paint job on the runway and taxi way at the Airport, saving the Airport Authority significant money.",null,null,"West Avenue sidewalk repairs completed."]
["Highlight 2"]
["Highlight 3"]
["Highlight 4"]
["Highlight 5"]
["Highlight 6"]
["Highlight 7"]
["Highlight 8"]
["Highlights Concaetenation",{"$f":"B28&CHAR(10)&B29&CHAR(10)&B30&CHAR(10)&B31&CHAR(10)&B32&CHAR(10)&B33&CHAR(10)&B34&CHAR(10)&B35","v":"\n\n\n\n\n\n\n"},{"$f":"C28&CHAR(10)&C29&CHAR(10)&C30&CHAR(10)&C31&CHAR(10)&C32&CHAR(10)&C33&CHAR(10)&C34&CHAR(10)&C35","v":"\n\n\n\n\n\n\n"},"\n\n\n\n\n\n\n","\n\n\n\n\n\n\n","\n\n\n\n\n\n\n","\n\n\n\n\n\n\n","\n\n\n\n\n\n\n","\n\n\n\n\n\n\n","\n\n\n\n\n\n\n","\n\n\n\n\n\n\n","\n\n\n\n\n\n\n","\n\n\n\n\n\n\n","\n\n\n\n\n\n\n","\n\n\n\n\n\n\n","\n\n\n\n\n\n\n","\n\n\n\n\n\n\n","\n\n\n\n\n\n\n","\n\n\n\n\n\n\n","\n\n\n\n\n\n\n","\n\n\n\n\n\n\n","\n\n\n\n\n\n\n","\n\n\n\n\n\n\n","\n\n\n\n\n\n\n","\n\n\n\n\n\n\n","\n\n\n\n\n\n\n","\n\n\n\n\n\n\n","\n\n\n\n\n\n\n","\n\n\n\n\n\n\n","\n\n\n\n\n\n\n","\n\n\n\n\n\n\n","\n\n\n\n\n\n\n","\n\n\n\n\n\n\n","\n\n\n\n\n\n\n","\n\n\n\n\n\n\n","\n\n\n\n\n\n\n",{"$f":"AK28&CHAR(10)&CHAR(10)&AK29&CHAR(10)&CHAR(10)&AK30&CHAR(10)&CHAR(10)&AK31&CHAR(10)&CHAR(10)&AK32&CHAR(10)&CHAR(10)&AK33&CHAR(10)&CHAR(10)&AK34&CHAR(10)&CHAR(10)&AK35","v":"\n\n\n\n\n\n\n\n\n\n\n\n\n\n"},null,{"$f":"AM28&CHAR(10)&CHAR(10)&AM29&CHAR(10)&CHAR(10)&AM30&CHAR(10)&CHAR(10)&AM31&CHAR(10)&CHAR(10)&AM32&CHAR(10)&CHAR(10)&AM33&CHAR(10)&CHAR(10)&AM34&CHAR(10)&CHAR(10)&AM35","v":"\n\n\n\n\n\n\n\n\n\n\n\n\n\n"},"1.  Completed a paint job on the runway and taxi way at the Airport, saving the Airport Authority significant money.\n\n\n\n\n\n\n\n\n\n\n\n\n\n","\n\n\n\n\n\n\n\n\n\n\n\n\n\n","\n\n\n\n\n\n\n\n\n\n\n\n\n\n","West Avenue sidewalk repairs completed.\n\n\n\n\n\n\n\n\n\n\n\n\n\n","\n\n\n\n\n\n\n\n\n\n\n\n\n\n"]
[]
[]
[]
["Bullet Chart Source","Target","What's Better?","Band 1","Band 2","YTD Type","Max Scale","Actual 1","Actual","Actual 3","Projection 1","Projection 2","Projection 3","First Zone 1","First Zone 2","First Zone 3","Second Zone 1","Second Zone 2","Second Zone 3","Previous X 1","Previous X 2","Previous Y 1","Previous Y 2"]
[{"$f":"A5","v":"Road Maintenance Work Orders Completed"},413,"Middle",0.93,1.07,"Sum",{"$f":"ROUNDUP((ROUNDUP(MAX(B41,SUM(I41,L41)),-LEN(EVEN(MAX(B41,SUM(I41,L41))))+2)/5),-LEN(EVEN(ROUNDUP(MAX(B41,SUM(I41,L41)),-LEN(EVEN(MAX(B41,SUM(I41,L41))))+2)/5))+1)*5","v":450},0,{"$f":"IF(F41=\"Sum\",SUM(OFFSET(A5,0,YTDBeg,1,YTDWidth)),AVERAGE(OFFSET(A5,0,YTDBeg,1,YTDWidth)))","v":304},0,0,{"$f":"IF(F41=\"Sum\",Projection*(I41/YTDWidth*12-I41),0)","v":0},0,{"$f":"B41*D41","v":384.09000000000003},{"$f":"((I41+L41<=N41)*(N41-(I41+L41)))","v":80.090000000000032},{"$f":"N41","v":384.09000000000003},{"$f":"(E41-D41)*B41","v":57.820000000000007},{"$f":"((I41+L41<=N41+Q41)*((N41+Q41)-(I41+L41+O41)))","v":57.819999999999993},{"$f":"Q41","v":57.820000000000007},{"$f":"IF(F41=\"Sum\",SUM(OFFSET(A5,0,YTDBeg-12,1,YTDWidth)),AVERAGE(OFFSET(A5,0,YTDBeg-12,1,YTDWidth)))","v":314},{"$f":"T41","v":314},1,2]
[{"$f":"A6","v":"Pot Holes Repaired"},193,"Middle",0.93,1.07,"Sum",{"$f":"ROUNDUP((ROUNDUP(MAX(B42,SUM(I42,L42)),-LEN(EVEN(MAX(B42,SUM(I42,L42))))+2)/5),-LEN(EVEN(ROUNDUP(MAX(B42,SUM(I42,L42)),-LEN(EVEN(MAX(B42,SUM(I42,L42))))+2)/5))+1)*5","v":200},0,68,0,0,0,0,179.49,{"$f":"((I42+L42<=N42)*(N42-(I42+L42)))","v":111.49000000000001},{"$f":"N42","v":179.49},27.020000000000003,{"$f":"((I42+L42<=N42+Q42)*((N42+Q42)-(I42+L42+O42)))","v":27.02000000000001},{"$f":"Q42","v":27.020000000000003},47,{"$f":"T42","v":47},1,2]
["Tons of Asphalt Spread",295,"Middle",0.93,1.07,"Sum",300,0,107,0,0,0,0,274.35000000000002,167.35000000000002,274.35000000000002,41.300000000000004,41.300000000000011,41.300000000000004,140.07999999999998,140.07999999999998,1,2]
["Utility Cuts Repaired",383,"Middle",0.93,1.07,"Sum",400,0,186,0,0,0,0,356.19,170.19,356.19,53.620000000000005,53.620000000000005,53.620000000000005,187,187,1,2]
["Square Feet of Sidewalk Repaired",7278,"More",0.85,1,"Sum",20000,0,15635,0,0,0,0,6186.3,0,6186.3,1091.7000000000003,0,1091.7000000000003,3934,3934,1,2]
["Roadside Mowing (Lane Miles)",1747,"Middle",0.93,1.07,"Sum",2000,0,458.9,0,0,0,0,1624.71,1165.81,1624.71,244.58,244.57999999999993,244.58,{"$error":"#N/A"},{"$error":"#N/A"},1,2]
["Complaints Received About Road Conditions",94,"Less",1,1.1499999999999999,"Sum",100,0,63,0,0,0,0,94,31,94,14.099999999999991,14.099999999999994,14.099999999999991,47,47,1,2]
["Tree Trimming Work Orders Completed",142,"Middle",0.93,1.07,"Sum",150,0,79,0,0,0,0,132.06,53.06,132.06,19.880000000000003,19.879999999999995,19.880000000000003,94,94,1,2]
["Landscaping Work Orders Completed",42,"Middle",0.93,1.07,"Sum",50,0,20,0,0,0,0,39.06,19.060000000000002,39.06,5.8800000000000008,5.8800000000000026,5.8800000000000008,19,19,1,2]
["Facility Maintenance Work Orders Completed",102,"Less",1,1.1499999999999999,"Sum",150,0,40,0,0,0,0,102,62,102,15.29999999999999,15.299999999999983,15.29999999999999,43,43,1,2]
["Staff Injuries (Public Works)",0,"Less",1,1.1499999999999999,"Sum",5,0,1,0,0,0,0,0,0,0,0,0,0,0,0,1,2]
[]
[]
[]
[]
[]
[]
[]
[]
[]
[]
[]
[]
[]
["SPARKLINE SOURCE"]
[null,11,10,9,8,7,6,5,4,3,2,1,0]
["Measure",{"$f":"OFFSET($A4,0,CurrentMonthCount-B$66,1,1)","v":"2011-02-01"},"2011-03-01","2011-04-01","2011-05-01","2011-06-01","2011-07-01","2011-08-01","2011-09-01","2011-10-01","2011-11-01","2011-12-01","2012-01-01"]
[{"$f":"A5","v":"Road Maintenance Work Orders Completed"},{"$f":"OFFSET($A5,0,CurrentMonthCount-B$66,1,1)","v":53},90,72,45,43,68,54,32,54,17,38,41]
[{"$f":"A6","v":"Pot Holes Repaired"},{"$f":"OFFSET($A6,0,CurrentMonthCount-B$66,1,1)","v":40},28,21,5,9,15,10,5,8,3,14,13]
["Tons of Asphalt Spread",{"$f":"OFFSET($A7,0,CurrentMonthCount-B$66,1,1)","v":28},39,24,5,9,16,15,21,20,8,9,18]
["Utility Cuts Repaired",{"$f":"OFFSET($A8,0,CurrentMonthCount-B$66,1,1)","v":64},65,22,5,20,39,30,24,31,17,8,37]
["Square Feet of Sidewalk Repaired",{"$f":"OFFSET($A9,0,CurrentMonthCount-B$66,1,1)","v":1400},3090,4002,1690,2995,3852,3268,2882,3412,0,1595,626]
["Roadside Mowing (Lane Miles)",{"$f":"OFFSET($A10,0,CurrentMonthCount-B$66,1,1)","v":{"$error":"#N/A"}},{"$error":"#N/A"},{"$error":"#N/A"},{"$error":"#N/A"},{"$error":"#N/A"},113.6,108,119.3,118,0,0,0]
["Complaints Received About Road Conditions",{"$f":"OFFSET($A11,0,CurrentMonthCount-B$66,1,1)","v":8},6,11,12,7,13,12,12,11,4,3,8]
["Tree Trimming Work Orders Completed",{"$f":"OFFSET($A12,0,CurrentMonthCount-B$66,1,1)","v":9},5,6,10,15,7,21,13,8,5,12,13]
["Landscaping Work Orders Completed",{"$f":"OFFSET($A13,0,CurrentMonthCount-B$66,1,1)","v":4},6,8,6,1,2,1,3,4,6,2,2]
["Facility Maintenance Work Orders Completed",{"$f":"OFFSET($A14,0,CurrentMonthCount-B$66,1,1)","v":4},3,10,7,1,4,7,4,8,7,5,5]
["Staff Injuries (Public Works)",{"$f":"OFFSET($A15,0,CurrentMonthCount-B$66,1,1)","v":0},0,0,0,0,1,0,0,0,0,0,0]
[0,{"$f":"OFFSET($A16,0,CurrentMonthCount-B$66,1,1)","v":0},0,0,0,0,0,0,0,0,0,0,0]
[0,{"$f":"OFFSET($A17,0,CurrentMonthCount-B$66,1,1)","v":0},0,0,0,0,0,0,0,0,0,0,0]
[0,{"$f":"OFFSET($A18,0,CurrentMonthCount-B$66,1,1)","v":0},0,0,0,0,0,0,0,0,0,0,0]
[0,{"$f":"OFFSET($A19,0,CurrentMonthCount-B$66,1,1)","v":0},0,0,0,0,0,0,0,0,0,0,0]
[0,{"$f":"OFFSET($A20,0,CurrentMonthCount-B$66,1,1)","v":0},0,0,0,0,0,0,0,0,0,0,0]
[0,{"$f":"OFFSET($A21,0,CurrentMonthCount-B$66,1,1)","v":0},0,0,0,0,0,0,0,0,0,0,0]
[0,{"$f":"OFFSET($A22,0,CurrentMonthCount-B$66,1,1)","v":0},0,0,0,0,0,0,0,0,0,0,0]
[0,{"$f":"OFFSET($A23,0,CurrentMonthCount-B$66,1,1)","v":0},0,0,0,0,0,0,0,0,0,0,0]
[0,{"$f":"OFFSET($A24,0,CurrentMonthCount-B$66,1,1)","v":0},0,0,0,0,0,0,0,0,0,0,0]
[]
[]
[]
[]
[]
[]
[]
[]
[]
[]
[]
[]
[]
[]
[]
[]
[]
["Pictures"]
[]
["Public Works crews have been working on repairing sidewalks at various locations around the city.  Pictured on the left is a sidewalk repair project on Cherokee St, near the intersection of Cherokee and Tennessee."]
["A recently repaired sidewalk at the intersection of Cherokee and Erwin, in front of the Gold Dome Courthouse."]

{"sheet":"Planning","index":15,"n_rows":14,"n_cols":9,"rows_kept":14,"cut":false,"hidden":false,"merged":[]}
[{"$f":"CurrentMonth","v":"2012-01-01"},null,null,null,"PLANNING & DEVELOPMENT"]
[]
["Development","Last 12 Months","Fiscal Year to Date","FYTD",null,"Licenses","Last 12 Months","Fiscal Year to Date","FYTD"]
[{"$f":"'Planning Data'!A5","v":"Residential Building Permits Issued"},null,null,{"$f":"'Planning Data'!I41","v":2},null,{"$f":"'Planning Data'!A16","v":"New Business Licenses Issued"},null,null,{"$f":"'Planning Data'!I52","v":127}]
[{"$f":"'Planning Data'!A6","v":"Remodel Permits Issued"},null,null,{"$f":"'Planning Data'!I42","v":31},null,{"$f":"'Planning Data'!A17","v":"Business Licenses Renewed"},null,null,{"$f":"'Planning Data'!I53","v":740}]
[{"$f":"'Planning Data'!A7","v":"Non-residential Building Permits Issued"},null,null,{"$f":"'Planning Data'!I43","v":25},null,{"$f":"'Planning Data'!A18","v":"New Alcohol Licenses Issued"},null,null,{"$f":"'Planning Data'!I54","v":7}]
[{"$f":"'Planning Data'!A8","v":"Land Disturbance Permits Issued"},null,null,{"$f":"'Planning Data'!I44","v":2},null,{"$f":"'Planning Data'!A19","v":"Alcohol Licenses Renewed"},null,null,{"$f":"'Planning Data'!I55","v":161}]
[{"$f":"'Planning Data'!A9","v":"Sign Permits Issued"},null,null,{"$f":"'Planning Data'!I45","v":51}]
[{"$f":"'Planning Data'!A10","v":"Inspections Performed"},null,null,{"$f":"'Planning Data'!I46","v":180},null,"Neighborhoods"]
[{"$f":"'Planning Data'!A11","v":"Annexation Cases"},null,null,{"$f":"'Planning Data'!I47","v":2},null,{"$f":"'Planning Data'!A20","v":"Code Violations"},null,null,{"$f":"'Planning Data'!I56","v":424}]
[{"$f":"'Planning Data'!A12","v":"Zoning Cases"},null,null,{"$f":"'Planning Data'!I48","v":2},null,{"$f":"'Planning Data'!A21","v":"Foreclosure Notices"},null,null,{"$f":"'Planning Data'!I57","v":129}]
[{"$f":"'Planning Data'!A13","v":"Historic Preservation Cases"},null,null,{"$f":"'Planning Data'!I49","v":7}]
[{"$f":"'Planning Data'!A14","v":"Variance Cases"},null,null,{"$f":"'Planning Data'!I50","v":11}]
[{"$f":"'Planning Data'!A15","v":"Plan Reviews"},null,null,{"$f":"'Planning Data'!I51","v":20}]

{"sheet":"Planning Data","index":16,"n_rows":87,"n_cols":44,"rows_kept":87,"cut":false,"hidden":true,"merged":[]}
["Planning Data"]
[]
[]
["Measure","2008-07-01","2008-08-01","2008-09-01","2008-10-01","2008-11-01","2008-12-01","2009-01-01","2009-02-01","2009-03-01","2009-04-01","2009-05-01","2009-06-01","2009-07-01","2009-08-01","2009-09-01","2009-10-01","2009-11-01","2009-12-01","2010-01-01","2010-02-01","2010-03-01","2010-04-01","2010-05-01","2010-06-01","2010-07-01","2010-08-01","2010-09-01","2010-10-01","2010-11-01","2010-12-01","2011-01-01","2011-02-01","2011-03-01","2011-04-01","2011-05-01","2011-06-01","2011-07-01","2011-08-01","2011-09-01","2011-10-01","2011-11-01","2011-12-01","2012-01-01"]
["Residential Building Permits Issued",{"$error":"#N/A"},{"$error":"#N/A"},{"$error":"#N/A"},{"$error":"#N/A"},{"$error":"#N/A"},{"$error":"#N/A"},{"$error":"#N/A"},{"$error":"#N/A"},{"$error":"#N/A"},{"$error":"#N/A"},{"$error":"#N/A"},{"$error":"#N/A"},{"$error":"#N/A"},{"$error":"#N/A"},{"$error":"#N/A"},{"$error":"#N/A"},{"$error":"#N/A"},{"$error":"#N/A"},0,2,0,0,0,1,2,5,0,0,0,0,0,0,1,1,1,0,2,0,0,0,0,0,0]
["Remodel Permits Issued",{"$error":"#N/A"},{"$error":"#N/A"},{"$error":"#N/A"},{"$error":"#N/A"},{"$error":"#N/A"},{"$error":"#N/A"},{"$error":"#N/A"},{"$error":"#N/A"},{"$error":"#N/A"},{"$error":"#N/A"},{"$error":"#N/A"},{"$error":"#N/A"},{"$error":"#N/A"},{"$error":"#N/A"},{"$error":"#N/A"},{"$error":"#N/A"},{"$error":"#N/A"},{"$error":"#N/A"},1,3,5,6,5,5,9,6,4,5,2,0,0,3,0,5,5,7,3,3,5,4,4,5,7]
["Non-residential Building Permits Issued",{"$error":"#N/A"},{"$error":"#N/A"},{"$error":"#N/A"},{"$error":"#N/A"},{"$error":"#N/A"},{"$error":"#N/A"},{"$error":"#N/A"},{"$error":"#N/A"},{"$error":"#N/A"},{"$error":"#N/A"},{"$error":"#N/A"},{"$error":"#N/A"},{"$error":"#N/A"},{"$error":"#N/A"},{"$error":"#N/A"},{"$error":"#N/A"},{"$error":"#N/A"},{"$error":"#N/A"},0,1,5,0,1,1,1,2,0,2,0,1,4,2,4,3,6,10,4,5,5,3,2,0,6]
["Land Disturbance Permits Issued",{"$error":"#N/A"},{"$error":"#N/A"},{"$error":"#N/A"},{"$error":"#N/A"},{"$error":"#N/A"},{"$error":"#N/A"},{"$error":"#N/A"},{"$error":"#N/A"},{"$error":"#N/A"},{"$error":"#N/A"},{"$error":"#N/A"},{"$error":"#N/A"},{"$error":"#N/A"},{"$error":"#N/A"},{"$error":"#N/A"},{"$error":"#N/A"},{"$error":"#N/A"},{"$error":"#N/A"},0,0,0,0,0,0,0,0,0,0,0,0,1,0,0,0,2,0,0,0,0,1,1,0,0]
["Sign Permits Issued",{"$error":"#N/A"},{"$error":"#N/A"},{"$error":"#N/A"},{"$error":"#N/A"},{"$error":"#N/A"},{"$error":"#N/A"},{"$error":"#N/A"},{"$error":"#N/A"},{"$error":"#N/A"},{"$error":"#N/A"},{"$error":"#N/A"},{"$error":"#N/A"},{"$error":"#N/A"},{"$error":"#N/A"},{"$error":"#N/A"},{"$error":"#N/A"},{"$error":"#N/A"},{"$error":"#N/A"},13,7,16,14,5,7,11,10,6,8,5,2,8,11,11,16,7,9,8,9,11,7,3,5,8]
["Inspections Performed",{"$error":"#N/A"},{"$error":"#N/A"},{"$error":"#N/A"},{"$error":"#N/A"},{"$error":"#N/A"},{"$error":"#N/A"},{"$error":"#N/A"},{"$error":"#N/A"},{"$error":"#N/A"},{"$error":"#N/A"},{"$error":"#N/A"},{"$error":"#N/A"},{"$error":"#N/A"},{"$error":"#N/A"},{"$error":"#N/A"},{"$error":"#N/A"},{"$error":"#N/A"},{"$error":"#N/A"},45,42,48,40,24,24,24,65,31,36,39,10,11,20,40,21,22,32,37,30,17,13,18,27,38]
["Annexation Cases",{"$error":"#N/A"},{"$error":"#N/A"},{"$error":"#N/A"},{"$error":"#N/A"},{"$error":"#N/A"},{"$error":"#N/A"},{"$error":"#N/A"},{"$error":"#N/A"},{"$error":"#N/A"},{"$error":"#N/A"},{"$error":"#N/A"},{"$error":"#N/A"},{"$error":"#N/A"},{"$error":"#N/A"},{"$error":"#N/A"},{"$error":"#N/A"},{"$error":"#N/A"},{"$error":"#N/A"},0,0,0,0,0,0,0,2,0,1,0,1,0,0,0,1,0,0,0,0,0,0,0,0,2]
["Zoning Cases",{"$error":"#N/A"},{"$error":"#N/A"},{"$error":"#N/A"},{"$error":"#N/A"},{"$error":"#N/A"},{"$error":"#N/A"},{"$error":"#N/A"},{"$error":"#N/A"},{"$error":"#N/A"},{"$error":"#N/A"},{"$error":"#N/A"},{"$error":"#N/A"},{"$error":"#N/A"},{"$error":"#N/A"},{"$error":"#N/A"},{"$error":"#N/A"},{"$error":"#N/A"},{"$error":"#N/A"},0,0,0,0,1,1,0,0,1,1,0,1,0,1,0,1,0,1,0,0,0,0,1,1,0]
["Historic Preservation Cases",{"$error":"#N/A"},{"$error":"#N/A"},{"$error":"#N/A"},{"$error":"#N/A"},{"$error":"#N/A"},{"$error":"#N/A"},{"$error":"#N/A"},{"$error":"#N/A"},{"$error":"#N/A"},{"$error":"#N/A"},{"$error":"#N/A"},{"$error":"#N/A"},{"$error":"#N/A"},{"$error":"#N/A"},{"$error":"#N/A"},{"$error":"#N/A"},{"$error":"#N/A"},{"$error":"#N/A"},0,2,0,0,1,2,2,1,1,0,0,1,1,1,0,3,2,2,1,2,1,2,1,0,0]
["Variance Cases",{"$error":"#N/A"},{"$error":"#N/A"},{"$error":"#N/A"},{"$error":"#N/A"},{"$error":"#N/A"},{"$error":"#N/A"},{"$error":"#N/A"},{"$error":"#N/A"},{"$error":"#N/A"},{"$error":"#N/A"},{"$error":"#N/A"},{"$error":"#N/A"},{"$error":"#N/A"},{"$error":"#N/A"},{"$error":"#N/A"},{"$error":"#N/A"},{"$error":"#N/A"},{"$error":"#N/A"},1,2,3,0,1,4,2,0,0,2,1,0,0,1,2,0,0,4,1,1,1,3,1,1,3]
["Plan Reviews",{"$error":"#N/A"},{"$error":"#N/A"},{"$error":"#N/A"},{"$error":"#N/A"},{"$error":"#N/A"},{"$error":"#N/A"},{"$error":"#N/A"},{"$error":"#N/A"},{"$error":"#N/A"},{"$error":"#N/A"},{"$error":"#N/A"},{"$error":"#N/A"},{"$error":"#N/A"},{"$error":"#N/A"},{"$error":"#N/A"},{"$error":"#N/A"},{"$error":"#N/A"},{"$error":"#N/A"},3,2,5,0,7,5,2,6,2,5,4,4,3,1,5,4,4,6,1,2,4,7,3,1,2]
["New Business Licenses Issued",{"$error":"#N/A"},{"$error":"#N/A"},{"$error":"#N/A"},{"$error":"#N/A"},{"$error":"#N/A"},{"$error":"#N/A"},{"$error":"#N/A"},{"$error":"#N/A"},{"$error":"#N/A"},{"$error":"#N/A"},{"$error":"#N/A"},{"$error":"#N/A"},{"$error":"#N/A"},{"$error":"#N/A"},{"$error":"#N/A"},{"$error":"#N/A"},{"$error":"#N/A"},{"$error":"#N/A"},14,34,24,31,18,31,19,17,18,12,5,9,6,7,12,19,12,9,22,29,21,13,15,8,19]
["Business Licenses Renewed",{"$error":"#N/A"},{"$error":"#N/A"},{"$error":"#N/A"},{"$error":"#N/A"},{"$error":"#N/A"},{"$error":"#N/A"},{"$error":"#N/A"},{"$error":"#N/A"},{"$error":"#N/A"},{"$error":"#N/A"},{"$error":"#N/A"},{"$error":"#N/A"},{"$error":"#N/A"},{"$error":"#N/A"},{"$error":"#N/A"},{"$error":"#N/A"},{"$error":"#N/A"},{"$error":"#N/A"},{"$error":"#N/A"},{"$error":"#N/A"},{"$error":"#N/A"},{"$error":"#N/A"},{"$error":"#N/A"},{"$error":"#N/A"},{"$error":"#N/A"},{"$error":"#N/A"},{"$error":"#N/A"},{"$error":"#N/A"},{"$error":"#N/A"},{"$error":"#N/A"},{"$error":"#N/A"},{"$error":"#N/A"},{"$error":"#N/A"},{"$error":"#N/A"},{"$error":"#N/A"},{"$error":"#N/A"},3,6,1,0,3,147,580]
["New Alcohol Licenses Issued",{"$error":"#N/A"},{"$error":"#N/A"},{"$error":"#N/A"},{"$error":"#N/A"},{"$error":"#N/A"},{"$error":"#N/A"},{"$error":"#N/A"},{"$error":"#N/A"},{"$error":"#N/A"},{"$error":"#N/A"},{"$error":"#N/A"},{"$error":"#N/A"},{"$error":"#N/A"},{"$error":"#N/A"},{"$error":"#N/A"},{"$error":"#N/A"},{"$error":"#N/A"},{"$error":"#N/A"},3,2,1,2,6,2,3,0,0,3,0,8,1,1,1,3,3,2,0,1,0,0,0,6,0]
["Alcohol Licenses Renewed",{"$error":"#N/A"},{"$error":"#N/A"},{"$error":"#N/A"},{"$error":"#N/A"},{"$error":"#N/A"},{"$error":"#N/A"},{"$error":"#N/A"},{"$error":"#N/A"},{"$error":"#N/A"},{"$error":"#N/A"},{"$error":"#N/A"},{"$error":"#N/A"},{"$error":"#N/A"},{"$error":"#N/A"},{"$error":"#N/A"},{"$error":"#N/A"},{"$error":"#N/A"},{"$error":"#N/A"},{"$error":"#N/A"},{"$error":"#N/A"},{"$error":"#N/A"},{"$error":"#N/A"},{"$error":"#N/A"},{"$error":"#N/A"},{"$error":"#N/A"},{"$error":"#N/A"},{"$error":"#N/A"},{"$error":"#N/A"},{"$error":"#N/A"},{"$error":"#N/A"},{"$error":"#N/A"},{"$error":"#N/A"},{"$error":"#N/A"},{"$error":"#N/A"},{"$error":"#N/A"},{"$error":"#N/A"},0,1,0,0,1,158,1]
["Code Violations",{"$error":"#N/A"},{"$error":"#N/A"},{"$error":"#N/A"},{"$error":"#N/A"},{"$error":"#N/A"},{"$error":"#N/A"},{"$error":"#N/A"},{"$error":"#N/A"},{"$error":"#N/A"},{"$error":"#N/A"},{"$error":"#N/A"},{"$error":"#N/A"},{"$error":"#N/A"},{"$error":"#N/A"},{"$error":"#N/A"},{"$error":"#N/A"},{"$error":"#N/A"},{"$error":"#N/A"},51,53,77,96,70,68,87,81,57,48,47,55,45,55,58,112,85,133,71,99,57,56,41,41,59]
["Foreclosure Notices",{"$error":"#N/A"},{"$error":"#N/A"},{"$error":"#N/A"},{"$error":"#N/A"},{"$error":"#N/A"},{"$error":"#N/A"},{"$error":"#N/A"},{"$error":"#N/A"},{"$error":"#N/A"},{"$error":"#N/A"},{"$error":"#N/A"},{"$error":"#N/A"},{"$error":"#N/A"},{"$error":"#N/A"},{"$error":"#N/A"},{"$error":"#N/A"},{"$error":"#N/A"},{"$error":"#N/A"},22,35,38,31,23,18,25,39,29,26,32,31,17,22,25,22,11,14,30,13,10,13,30,13,20]
[]
[]
[]
[]
[]
["HIGHLIGHTS","2008-07-01","2008-08-01","2008-09-01","2008-10-01","2008-11-01","2008-12-01","2009-01-01","2009-02-01","2009-03-01","2009-04-01","2009-05-01","2009-06-01","2009-07-01","2009-08-01","2009-09-01","2009-10-01","2009-11-01","2009-12-01","2010-01-01","2010-02-01","2010-03-01","2010-04-01","2010-05-01","2010-06-01","2010-07-01","2010-08-01","2010-09-01","2010-10-01","2010-11-01","2010-12-01","2011-01-01","2011-02-01","2011-03-01","2011-04-01","2011-05-01","2011-06-01","2011-07-01","2011-08-01","2011-09-01","2011-10-01","2011-11-01","2011-12-01","2012-01-01"]
["Highlight 1",null,null,null,null,null,null,null,null,null,null,null,null,null,null,null,null,null,null,null,null,null,null,null,null,null,null,null,null,null,null,null,null,null,null,null,null,null,"1.  Planning and Development staff are currently working on updating the sign ordinance.","1.  Continue to develop the revised sign ordinance.  Held work session for Council to review progress and provide input.","Starting 3rd Quarter Reports for Alcohol Licenses.","Annual business license renewals have begun in full force.  The new requirement for all businesses to complete SAVE documents has proven to be challenging.","Alcohol Sunday Sales started the first Sunday in December ","Completed alcohol renewals, in the middle of Ocupational Tax Certifacte renewals, and getting ready to start Insurance renewals. "]
["Highlight 2",null,null,null,null,null,null,null,null,null,null,null,null,null,null,null,null,null,null,null,null,null,null,null,null,null,null,null,null,null,null,null,null,null,null,null,null,null,null,null,null,"Sunday package sales of alcohol has begun.","Alcohol & Business license renewals are in full swing "]
["Highlight 3",null,null,null,null,null,null,null,null,null,null,null,null,null,null,null,null,null,null,null,null,null,null,null,null,null,null,null,null,null,null,null,null,null,null,null,null,null,null,null,null,null,"Each year GMA collects deliquent Municipal Insurance license Fees ($75/each) for Georgia cities. Due to continued effort of Catheryn and Connie to clean up the data base and collect deliquent accounts the City has been able to retail approximately $1,425.00 more in 2011 than in previous years.  "]
["Highlight 4"]
["Highlight 5"]
["Highlight 6"]
["Highlight 7"]
["Highlight 8"]
["Highlights Concaetenation",{"$f":"B28&CHAR(10)&B29&CHAR(10)&B30&CHAR(10)&B31&CHAR(10)&B32&CHAR(10)&B33&CHAR(10)&B34&CHAR(10)&B35","v":"\n\n\n\n\n\n\n"},{"$f":"C28&CHAR(10)&C29&CHAR(10)&C30&CHAR(10)&C31&CHAR(10)&C32&CHAR(10)&C33&CHAR(10)&C34&CHAR(10)&C35","v":"\n\n\n\n\n\n\n"},"\n\n\n\n\n\n\n","\n\n\n\n\n\n\n","\n\n\n\n\n\n\n","\n\n\n\n\n\n\n","\n\n\n\n\n\n\n","\n\n\n\n\n\n\n","\n\n\n\n\n\n\n","\n\n\n\n\n\n\n","\n\n\n\n\n\n\n","\n\n\n\n\n\n\n","\n\n\n\n\n\n\n","\n\n\n\n\n\n\n","\n\n\n\n\n\n\n","\n\n\n\n\n\n\n","\n\n\n\n\n\n\n","\n\n\n\n\n\n\n","\n\n\n\n\n\n\n","\n\n\n\n\n\n\n","\n\n\n\n\n\n\n","\n\n\n\n\n\n\n","\n\n\n\n\n\n\n","\n\n\n\n\n\n\n","\n\n\n\n\n\n\n","\n\n\n\n\n\n\n","\n\n\n\n\n\n\n","\n\n\n\n\n\n\n","\n\n\n\n\n\n\n","\n\n\n\n\n\n\n","\n\n\n\n\n\n\n","\n\n\n\n\n\n\n","\n\n\n\n\n\n\n","\n\n\n\n\n\n\n","\n\n\n\n\n\n\n",{"$f":"AK28&CHAR(10)&CHAR(10)&AK29&CHAR(10)&CHAR(10)&AK30&CHAR(10)&CHAR(10)&AK31&CHAR(10)&CHAR(10)&AK32&CHAR(10)&CHAR(10)&AK33&CHAR(10)&CHAR(10)&AK34&CHAR(10)&CHAR(10)&AK35","v":"\n\n\n\n\n\n\n\n\n\n\n\n\n\n"},"\n\n\n\n\n\n\n\n\n\n\n\n\n\n","1.  Planning and Development staff are currently working on updating the sign ordinance.\n\n\n\n\n\n\n\n\n\n\n\n\n\n","1.  Continue to develop the revised sign ordinance.  Held work session for Council to review progress and provide input.\n\n\n\n\n\n\n\n\n\n\n\n\n\n","Starting 3rd Quarter Reports for Alcohol Licenses.\n\n\n\n\n\n\n\n\n\n\n\n\n\n","Annual business license renewals have begun in full force.  The new requirement for all businesses to complete SAVE documents has proven to be challenging.\n\nSunday package sales of alcohol has begun.\n\n\n\n\n\n\n\n\n\n\n\n","Alcohol Sunday Sales started the first Sunday in December \n\nAlcohol & Business license renewals are in full swing \n\nEach year GMA collects deliquent Municipal Insurance license Fees ($75/each) for Georgia cities. Due to continued effort of Catheryn and Connie to clean up the data base and collect deliquent accounts the City has been able to retail approximately $1,425.00 more in 2011 than in previous years.  \n\n\n\n\n\n\n\n\n\n","Completed alcohol renewals, in the middle of Ocupational Tax Certifacte renewals, and getting ready to start Insurance renewals. \n\n\n\n\n\n\n\n\n\n\n\n\n\n"]
[]
[]
[]
["Bullet Chart Source","Target","What's Better?","Band 1","Band 2","YTD Type","Max Scale","Actual 1","Actual","Actual 3","Projection 1","Projection 2","Projection 3","First Zone 1","First Zone 2","First Zone 3","Second Zone 1","Second Zone 2","Second Zone 3","Previous X 1","Previous X 2","Previous Y 1","Previous Y 2"]
[{"$f":"A5","v":"Residential Building Permits Issued"},10,"More",0.85,1,"Sum",{"$f":"ROUNDUP((ROUNDUP(MAX(B41,SUM(I41,L41)),-LEN(EVEN(MAX(B41,SUM(I41,L41))))+2)/5),-LEN(EVEN(ROUNDUP(MAX(B41,SUM(I41,L41)),-LEN(EVEN(MAX(B41,SUM(I41,L41))))+2)/5))+1)*5","v":10},0,{"$f":"IF(F41=\"Sum\",SUM(OFFSET(A5,0,YTDBeg,1,YTDWidth)),AVERAGE(OFFSET(A5,0,YTDBeg,1,YTDWidth)))","v":2},0,0,{"$f":"IF(F41=\"Sum\",Projection*(I41/YTDWidth*12-I41),0)","v":0},0,{"$f":"B41*D41","v":8.5},{"$f":"((I41+L41<=N41)*(N41-(I41+L41)))","v":6.5},{"$f":"N41","v":8.5},{"$f":"(E41-D41)*B41","v":1.5000000000000002},{"$f":"((I41+L41<=N41+Q41)*((N41+Q41)-(I41+L41+O41)))","v":1.5},{"$f":"Q41","v":1.5000000000000002},{"$f":"IF(F41=\"Sum\",SUM(OFFSET(A5,0,YTDBeg-12,1,YTDWidth)),AVERAGE(OFFSET(A5,0,YTDBeg-12,1,YTDWidth)))","v":7},{"$f":"T41","v":7},1,2]
[{"$f":"A6","v":"Remodel Permits Issued"},51,"More",0.85,1,"Sum",{"$f":"ROUNDUP((ROUNDUP(MAX(B42,SUM(I42,L42)),-LEN(EVEN(MAX(B42,SUM(I42,L42))))+2)/5),-LEN(EVEN(ROUNDUP(MAX(B42,SUM(I42,L42)),-LEN(EVEN(MAX(B42,SUM(I42,L42))))+2)/5))+1)*5","v":100},0,31,0,0,0,0,43.35,{"$f":"((I42+L42<=N42)*(N42-(I42+L42)))","v":12.350000000000001},{"$f":"N42","v":43.35},7.6500000000000012,{"$f":"((I42+L42<=N42+Q42)*((N42+Q42)-(I42+L42+O42)))","v":7.6499999999999986},{"$f":"Q42","v":7.6500000000000012},26,{"$f":"T42","v":26},1,2]
["Non-residential Building Permits Issued",14,"More",0.85,1,"Sum",25,0,25,0,0,0,0,11.9,0,11.9,2.1000000000000005,0,2.1000000000000005,10,10,1,2]
["Land Disturbance Permits Issued",5,"More",0.85,1,"Sum",5,0,2,0,0,0,0,4.25,2.25,4.25,0.75000000000000011,0.75,0.75000000000000011,1,1,1,2]
["Sign Permits Issued",100,"More",0.85,1,"Sum",100,0,51,0,0,0,0,85,34,85,15.000000000000002,15,15.000000000000002,50,50,1,2]
["Inspections Performed",428,"More",0.85,1,"Sum",450,0,180,0,0,0,0,363.8,183.8,363.8,64.2,64.199999999999989,64.2,216,216,1,2]
["Annexation Cases",4,"More",0.85,1,"Sum",5,0,2,0,0,0,0,3.4,1.4,3.4,0.60000000000000009,0.60000000000000009,0.60000000000000009,4,4,1,2]
["Zoning Cases",8,"More",0.85,1,"Sum",10,0,2,0,0,0,0,6.8,4.8,6.8,1.2000000000000002,1.2000000000000002,1.2000000000000002,3,3,1,2]
["Historic Preservation Cases",10,"More",0.85,1,"Sum",10,0,7,0,0,0,0,8.5,1.5,8.5,1.5000000000000002,1.5,1.5000000000000002,6,6,1,2]
["Variance Cases",16,"More",0.85,1,"Sum",20,0,11,0,0,0,0,13.6,2.5999999999999996,13.6,2.4000000000000004,2.4000000000000004,2.4000000000000004,5,5,1,2]
["Plan Reviews",45,"More",0.85,1,"Sum",50,0,20,0,0,0,0,38.25,18.25,38.25,6.7500000000000009,6.75,6.7500000000000009,26,26,1,2]
["New Business Licenses Issued",232,"More",0.85,1,"Sum",250,0,127,0,0,0,0,{"$f":"B52*D52","v":197.2},70.199999999999989,197.2,{"$f":"(E52-D52)*B52","v":34.800000000000004},34.800000000000011,34.800000000000004,86,86,1,2]
["Business Licenses Renewed",1562,"More",0.85,1,"Sum",2000,0,740,0,0,0,0,1327.7,587.70000000000005,1327.7,234.30000000000004,234.29999999999995,234.30000000000004,{"$error":"#N/A"},{"$error":"#N/A"},1,2]
["New Alcohol Licenses Issued",30,"More",0.85,1,"Sum",{"$f":"ROUNDUP((ROUNDUP(MAX(B54,SUM(I54,L54)),-LEN(EVEN(MAX(B54,SUM(I54,L54))))+2)/5),-LEN(EVEN(ROUNDUP(MAX(B54,SUM(I54,L54)),-LEN(EVEN(MAX(B54,SUM(I54,L54))))+2)/5))+1)*5","v":30},0,7,0,0,0,0,{"$f":"B54*D54","v":25.5},{"$f":"((I54+L54<=N54)*(N54-(I54+L54)))","v":18.5},{"$f":"N54","v":25.5},{"$f":"(E54-D54)*B54","v":4.5000000000000009},{"$f":"((I54+L54<=N54+Q54)*((N54+Q54)-(I54+L54+O54)))","v":4.5},{"$f":"Q54","v":4.5000000000000009},15,15,1,2]
["Alcohol Licenses Renewed",76,"More",0.85,1,"Sum",200,0,161,0,0,0,0,64.599999999999994,0,64.599999999999994,11.400000000000002,0,11.400000000000002,{"$error":"#N/A"},{"$error":"#N/A"},1,2]
["Code Violations",750,"Less",1,1.1499999999999999,"Sum",1000,0,424,0,0,0,0,750,326,750,112.49999999999993,112.49999999999989,112.49999999999993,420,420,1,2]
["Foreclosure Notices",250,"Less",1,1.1499999999999999,"Sum",250,0,129,0,0,0,0,250,121,250,37.499999999999979,37.5,37.499999999999979,199,199,1,2]
[]
[]
[]
[]
[]
[]
[]
["SPARKLINE SOURCE"]
[null,11,10,9,8,7,6,5,4,3,2,1,0]
["Measure",{"$f":"OFFSET($A4,0,CurrentMonthCount-B$66,1,1)","v":"2011-02-01"},"2011-03-01","2011-04-01","2011-05-01","2011-06-01","2011-07-01","2011-08-01","2011-09-01","2011-10-01","2011-11-01","2011-12-01","2012-01-01"]
[{"$f":"A5","v":"Residential Building Permits Issued"},{"$f":"OFFSET($A5,0,CurrentMonthCount-B$66,1,1)","v":0},1,1,1,0,2,0,0,0,0,0,0]
[{"$f":"A6","v":"Remodel Permits Issued"},{"$f":"OFFSET($A6,0,CurrentMonthCount-B$66,1,1)","v":3},0,5,5,7,3,3,5,4,4,5,7]
["Non-residential Building Permits Issued",{"$f":"OFFSET($A7,0,CurrentMonthCount-B$66,1,1)","v":2},4,3,6,10,4,5,5,3,2,0,6]
["Land Disturbance Permits Issued",{"$f":"OFFSET($A8,0,CurrentMonthCount-B$66,1,1)","v":0},0,0,2,0,0,0,0,1,1,0,0]
["Sign Permits Issued",{"$f":"OFFSET($A9,0,CurrentMonthCount-B$66,1,1)","v":11},11,16,7,9,8,9,11,7,3,5,8]
["Inspections Performed",{"$f":"OFFSET($A10,0,CurrentMonthCount-B$66,1,1)","v":20},40,21,22,32,37,30,17,13,18,27,38]
["Annexation Cases",{"$f":"OFFSET($A11,0,CurrentMonthCount-B$66,1,1)","v":0},0,1,0,0,0,0,0,0,0,0,2]
["Zoning Cases",{"$f":"OFFSET($A12,0,CurrentMonthCount-B$66,1,1)","v":1},0,1,0,1,0,0,0,0,1,1,0]
["Historic Preservation Cases",{"$f":"OFFSET($A13,0,CurrentMonthCount-B$66,1,1)","v":1},0,3,2,2,1,2,1,2,1,0,0]
["Variance Cases",{"$f":"OFFSET($A14,0,CurrentMonthCount-B$66,1,1)","v":1},2,0,0,4,1,1,1,3,1,1,3]
["Plan Reviews",{"$f":"OFFSET($A15,0,CurrentMonthCount-B$66,1,1)","v":1},5,4,4,6,1,2,4,7,3,1,2]
["New Business Licenses Issued",{"$f":"OFFSET($A16,0,CurrentMonthCount-B$66,1,1)","v":7},12,19,12,9,22,29,21,13,15,8,19]
["Business Licenses Renewed",{"$f":"OFFSET($A17,0,CurrentMonthCount-B$66,1,1)","v":{"$error":"#N/A"}},{"$error":"#N/A"},{"$error":"#N/A"},{"$error":"#N/A"},{"$error":"#N/A"},3,6,1,0,3,147,580]
["New Alcohol Licenses Issued",{"$f":"OFFSET($A18,0,CurrentMonthCount-B$66,1,1)","v":1},1,3,3,2,0,1,0,0,0,6,0]
["Alcohol Licenses Renewed",{"$f":"OFFSET($A19,0,CurrentMonthCount-B$66,1,1)","v":{"$error":"#N/A"}},{"$error":"#N/A"},{"$error":"#N/A"},{"$error":"#N/A"},{"$error":"#N/A"},0,1,0,0,1,158,1]
["Code Violations",{"$f":"OFFSET($A20,0,CurrentMonthCount-B$66,1,1)","v":55},58,112,85,133,71,99,57,56,41,41,59]
["Foreclosure Notices",{"$f":"OFFSET($A21,0,CurrentMonthCount-B$66,1,1)","v":22},25,22,11,14,30,13,10,13,30,13,20]
[0,{"$f":"OFFSET($A22,0,CurrentMonthCount-B$66,1,1)","v":0},0,0,0,0,0,0,0,0,0,0,0]
[0,{"$f":"OFFSET($A23,0,CurrentMonthCount-B$66,1,1)","v":0},0,0,0,0,0,0,0,0,0,0,0]
[0,{"$f":"OFFSET($A24,0,CurrentMonthCount-B$66,1,1)","v":0},0,0,0,0,0,0,0,0,0,0,0]

{"sheet":"Garage","index":17,"n_rows":10,"n_cols":9,"rows_kept":10,"cut":false,"hidden":false,"merged":[]}
[{"$f":"CurrentMonth","v":"2012-01-01"},null,null,null,"GARAGE"]
[]
["Fleet Maintenance","Last 12 Months","Fiscal Year to Date","FYTD",null,"Fuel Sales","Last 12 Months","Fiscal Year to Date","FYTD"]
[{"$f":"'Garage Data'!A5","v":"Vehicles Serviced (City)"},null,null,{"$f":"'Garage Data'!I41","v":494},null,{"$f":"'Garage Data'!A10","v":"Diesel Fuel Sold (City Only)"},null,null,{"$f":"'Garage Data'!I46","v":43413.799999999996}]
[{"$f":"'Garage Data'!A6","v":"Vehicles Serviced (Other)"},null,null,{"$f":"'Garage Data'!I42","v":21},null,{"$f":"'Garage Data'!A11","v":"Diesel Fuel Sold (Other)"},null,null,{"$f":"'Garage Data'!I47","v":31589}]
[null,null,null,null,null,{"$f":"'Garage Data'!A12","v":"Unleaded Fuel Sold (City Only)"},null,null,{"$f":"'Garage Data'!I48","v":78713.650000000009}]
["Efficiency",null,null,null,null,{"$f":"'Garage Data'!A13","v":"Unleaded Fuel Sold (Other)"},null,null,{"$f":"'Garage Data'!I49","v":5879.05}]
[{"$f":"'Garage Data'!A7","v":"Billable Hours (City)"},null,null,{"$f":"'Garage Data'!I43","v":1004.85}]
[{"$f":"'Garage Data'!A8","v":"Billable Hours (Other)"},null,null,{"$f":"'Garage Data'!I44","v":39.5}]
[{"$f":"'Garage Data'!A9","v":"Billable Hours/Hours Paid"},null,null,{"$f":"'Garage Data'!I45","v":0.25477033337084348}]

{"sheet":"Garage Data","index":18,"n_rows":87,"n_cols":44,"rows_kept":87,"cut":false,"hidden":true,"merged":[]}
["Garage Data"]
[]
[]
["Measure","2008-07-01","2008-08-01","2008-09-01","2008-10-01","2008-11-01","2008-12-01","2009-01-01","2009-02-01","2009-03-01","2009-04-01","2009-05-01","2009-06-01","2009-07-01","2009-08-01","2009-09-01","2009-10-01","2009-11-01","2009-12-01","2010-01-01","2010-02-01","2010-03-01","2010-04-01","2010-05-01","2010-06-01","2010-07-01","2010-08-01","2010-09-01","2010-10-01","2010-11-01","2010-12-01","2011-01-01","2011-02-01","2011-03-01","2011-04-01","2011-05-01","2011-06-01","2011-07-01","2011-08-01","2011-09-01","2011-10-01","2011-11-01","2011-12-01","2012-01-01"]
["Vehicles Serviced (City)",{"$error":"#N/A"},{"$error":"#N/A"},{"$error":"#N/A"},{"$error":"#N/A"},{"$error":"#N/A"},{"$error":"#N/A"},{"$error":"#N/A"},{"$error":"#N/A"},{"$error":"#N/A"},{"$error":"#N/A"},{"$error":"#N/A"},{"$error":"#N/A"},{"$error":"#N/A"},{"$error":"#N/A"},{"$error":"#N/A"},{"$error":"#N/A"},{"$error":"#N/A"},{"$error":"#N/A"},70,55,83,81,65,78,72,90,85,88,74,63,77,75,87,81,73,78,83,69,62,47,87,76,70]
["Vehicles Serviced (Other)",{"$error":"#N/A"},{"$error":"#N/A"},{"$error":"#N/A"},{"$error":"#N/A"},{"$error":"#N/A"},{"$error":"#N/A"},{"$error":"#N/A"},{"$error":"#N/A"},{"$error":"#N/A"},{"$error":"#N/A"},{"$error":"#N/A"},{"$error":"#N/A"},{"$error":"#N/A"},{"$error":"#N/A"},{"$error":"#N/A"},{"$error":"#N/A"},{"$error":"#N/A"},{"$error":"#N/A"},0,0,1,1,0,2,1,2,1,2,0,2,0,0,1,1,0,2,3,2,3,3,1,4,5]
["Billable Hours (City)",{"$error":"#N/A"},{"$error":"#N/A"},{"$error":"#N/A"},{"$error":"#N/A"},{"$error":"#N/A"},{"$error":"#N/A"},{"$error":"#N/A"},{"$error":"#N/A"},{"$error":"#N/A"},{"$error":"#N/A"},{"$error":"#N/A"},{"$error":"#N/A"},{"$error":"#N/A"},{"$error":"#N/A"},{"$error":"#N/A"},{"$error":"#N/A"},{"$error":"#N/A"},{"$error":"#N/A"},149.1,120.5,146.80000000000001,137.75,137.4,112.05,113.35,141.75,151.5,168.6,151.75,148.55000000000001,137.35,145.1,146.80000000000001,137.75,145.4,112.05,153,112.75,125.5,95.2,174,164,180.4]
["Billable Hours (Other)",{"$error":"#N/A"},{"$error":"#N/A"},{"$error":"#N/A"},{"$error":"#N/A"},{"$error":"#N/A"},{"$error":"#N/A"},{"$error":"#N/A"},{"$error":"#N/A"},{"$error":"#N/A"},{"$error":"#N/A"},{"$error":"#N/A"},{"$error":"#N/A"},{"$error":"#N/A"},{"$error":"#N/A"},{"$error":"#N/A"},{"$error":"#N/A"},{"$error":"#N/A"},{"$error":"#N/A"},0,0,1,2,0,3,1.5,2,5.5,7,0,5,0,0,1,2,0,3,6.75,2,3.25,7,1,6.25,13.25]
["Billable Hours/Hours Paid",{"$error":"#N/A"},{"$error":"#N/A"},{"$error":"#N/A"},{"$error":"#N/A"},{"$error":"#N/A"},{"$error":"#N/A"},{"$error":"#N/A"},{"$error":"#N/A"},{"$error":"#N/A"},{"$error":"#N/A"},{"$error":"#N/A"},{"$error":"#N/A"},{"$error":"#N/A"},{"$error":"#N/A"},{"$error":"#N/A"},{"$error":"#N/A"},{"$error":"#N/A"},{"$error":"#N/A"},0.18637499999999999,0.15006249999999999,0.1835,0.17469999999999999,0.17180000000000001,0.14006250000000001,9.4458333333333325E-2,0.1771875,0.18937499999999999,0.21573896353166985,0.18968750000000001,0.12795833333333334,0.17168749999999999,0.18137499999999998,0.18475,0.1746875,0.18174999999999999,9.5875000000000002E-2,0.23772321428571427,0.17929687499999999,0.201171875,0.15968750000000001,0.2734375,0.19415870264352347,0.53791666666666671]
["Diesel Fuel Sold (City Only)",{"$error":"#N/A"},{"$error":"#N/A"},{"$error":"#N/A"},{"$error":"#N/A"},{"$error":"#N/A"},{"$error":"#N/A"},{"$error":"#N/A"},{"$error":"#N/A"},{"$error":"#N/A"},{"$error":"#N/A"},{"$error":"#N/A"},{"$error":"#N/A"},{"$error":"#N/A"},{"$error":"#N/A"},{"$error":"#N/A"},{"$error":"#N/A"},{"$error":"#N/A"},{"$error":"#N/A"},5437.5,5031.95,6332,5653.15,5584.7,6365.7,6204.45,6947.45,6085.9,5730,5821.5,5941.5,5406.95,5685.7,6873.05,6334.45,6546.45,7067.2,6868.7,7338.65,6281.25,5979.5,5907.25,5834.95,5203.5]
["Diesel Fuel Sold (Other)",{"$error":"#N/A"},{"$error":"#N/A"},{"$error":"#N/A"},{"$error":"#N/A"},{"$error":"#N/A"},{"$error":"#N/A"},{"$error":"#N/A"},{"$error":"#N/A"},{"$error":"#N/A"},{"$error":"#N/A"},{"$error":"#N/A"},{"$error":"#N/A"},{"$error":"#N/A"},{"$error":"#N/A"},{"$error":"#N/A"},{"$error":"#N/A"},{"$error":"#N/A"},{"$error":"#N/A"},4669.8999999999996,5122.6000000000004,6135.65,4468.6499999999996,4381.8500000000004,576.95000000000005,246.35,4484.8,5681.45,5673.2,5654.5,3767.75,4266.55,6224.7,7082.55,4337.55,4369.7,926.35,407.8,5211.6000000000004,6030.55,5379.8,5090.8500000000004,3552.95,5915.45]
["Unleaded Fuel Sold (City Only)",{"$error":"#N/A"},{"$error":"#N/A"},{"$error":"#N/A"},{"$error":"#N/A"},{"$error":"#N/A"},{"$error":"#N/A"},{"$error":"#N/A"},{"$error":"#N/A"},{"$error":"#N/A"},{"$error":"#N/A"},{"$error":"#N/A"},{"$error":"#N/A"},{"$error":"#N/A"},{"$error":"#N/A"},{"$error":"#N/A"},{"$error":"#N/A"},{"$error":"#N/A"},{"$error":"#N/A"},10838.2,10338.75,11668.7,10757.05,10568.75,12036.95,12219.05,12511.4,11658.5,11419,10131,10823.8,11008.35,11009.85,12764.1,11212.2,11667.45,12328.2,11469.75,12650.6,11181.1,11275.05,10587.8,10533.35,11016]
["Unleaded Fuel Sold (Other)",{"$error":"#N/A"},{"$error":"#N/A"},{"$error":"#N/A"},{"$error":"#N/A"},{"$error":"#N/A"},{"$error":"#N/A"},{"$error":"#N/A"},{"$error":"#N/A"},{"$error":"#N/A"},{"$error":"#N/A"},{"$error":"#N/A"},{"$error":"#N/A"},{"$error":"#N/A"},{"$error":"#N/A"},{"$error":"#N/A"},{"$error":"#N/A"},{"$error":"#N/A"},{"$error":"#N/A"},611.70000000000005,840.4,898.6,573.4,659,722.05,672.45,70.599999999999994,760.25,631.5,771.35,661.3,817.35,889.9,983.05,766.7,871.5,895.1,743.25,1081.7,1011.35,845.7,811.65,480.6,904.8]
[]
[]
[]
[]
[]
[]
[]
[]
[]
[]
[]
[]
[]
["HIGHLIGHTS","2008-07-01","2008-08-01","2008-09-01","2008-10-01","2008-11-01","2008-12-01","2009-01-01","2009-02-01","2009-03-01","2009-04-01","2009-05-01","2009-06-01","2009-07-01","2009-08-01","2009-09-01","2009-10-01","2009-11-01","2009-12-01","2010-01-01","2010-02-01","2010-03-01","2010-04-01","2010-05-01","2010-06-01","2010-07-01","2010-08-01","2010-09-01","2010-10-01","2010-11-01","2010-12-01","2011-01-01","2011-02-01","2011-03-01","2011-04-01","2011-05-01","2011-06-01","2011-07-01","2011-08-01","2011-09-01","2011-10-01","2011-11-01","2011-12-01","2012-01-01"]
["Highlight 1",null,null,null,null,null,null,null,null,null,null,null,null,null,null,null,null,null,null,null,null,null,null,null,null,null,null,null,null,null,null,null,null,null,null,null,null,null,null,"1.  We are trying to increase our ratio of billable hours to hours worked.  The ratio is increasing in large part due to the retirement of one Garage employee at the end of last fiscal year."]
["Highlight 2"]
["Highlight 3"]
["Highlight 4"]
["Highlight 5"]
["Highlight 6"]
["Highlight 7"]
["Highlight 8"]
["Highlights Concaetenation",{"$f":"B28&CHAR(10)&B29&CHAR(10)&B30&CHAR(10)&B31&CHAR(10)&B32&CHAR(10)&B33&CHAR(10)&B34&CHAR(10)&B35","v":"\n\n\n\n\n\n\n"},{"$f":"C28&CHAR(10)&C29&CHAR(10)&C30&CHAR(10)&C31&CHAR(10)&C32&CHAR(10)&C33&CHAR(10)&C34&CHAR(10)&C35","v":"\n\n\n\n\n\n\n"},"\n\n\n\n\n\n\n","\n\n\n\n\n\n\n","\n\n\n\n\n\n\n","\n\n\n\n\n\n\n","\n\n\n\n\n\n\n","\n\n\n\n\n\n\n","\n\n\n\n\n\n\n","\n\n\n\n\n\n\n","\n\n\n\n\n\n\n","\n\n\n\n\n\n\n","\n\n\n\n\n\n\n","\n\n\n\n\n\n\n","\n\n\n\n\n\n\n","\n\n\n\n\n\n\n","\n\n\n\n\n\n\n","\n\n\n\n\n\n\n","\n\n\n\n\n\n\n","\n\n\n\n\n\n\n","\n\n\n\n\n\n\n","\n\n\n\n\n\n\n","\n\n\n\n\n\n\n","\n\n\n\n\n\n\n","\n\n\n\n\n\n\n","\n\n\n\n\n\n\n","\n\n\n\n\n\n\n","\n\n\n\n\n\n\n","\n\n\n\n\n\n\n","\n\n\n\n\n\n\n","\n\n\n\n\n\n\n","\n\n\n\n\n\n\n","\n\n\n\n\n\n\n","\n\n\n\n\n\n\n","\n\n\n\n\n\n\n",{"$f":"AK28&CHAR(10)&AK29&CHAR(10)&AK30&CHAR(10)&AK31&CHAR(10)&AK32&CHAR(10)&AK33&CHAR(10)&AK34&CHAR(10)&AK35","v":"\n\n\n\n\n\n\n"},"\n\n\n\n\n\n\n","\n\n\n\n\n\n\n","1.  We are trying to increase our ratio of billable hours to hours worked.  The ratio is increasing in large part due to the retirement of one Garage employee at the end of last fiscal year.\n\n\n\n\n\n\n",{"$f":"AO28&CHAR(10)&AO29&CHAR(10)&AO30&CHAR(10)&AO31&CHAR(10)&AO32&CHAR(10)&AO33&CHAR(10)&AO34&CHAR(10)&AO35","v":"\n\n\n\n\n\n\n"},"\n\n\n\n\n\n\n",{"$f":"AQ28&CHAR(10)&AQ29&CHAR(10)&AQ30&CHAR(10)&AQ31&CHAR(10)&AQ32&CHAR(10)&AQ33&CHAR(10)&AQ34&CHAR(10)&AQ35","v":"\n\n\n\n\n\n\n"},"\n\n\n\n\n\n\n"]
[]
[]
[]
["Bullet Chart Source","Target","What's Better?","Band 1","Band 2","YTD Type","Max Scale","Actual 1","Actual","Actual 3","Projection 1","Projection 2","Projection 3","First Zone 1","First Zone 2","First Zone 3","Second Zone 1","Second Zone 2","Second Zone 3","Previous X 1","Previous X 2","Previous Y 1","Previous Y 2"]
[{"$f":"A5","v":"Vehicles Serviced (City)"},900,"Middle",0.93,1.07,"Sum",{"$f":"ROUNDUP((ROUNDUP(MAX(B41,SUM(I41,L41)),-LEN(EVEN(MAX(B41,SUM(I41,L41))))+2)/5),-LEN(EVEN(ROUNDUP(MAX(B41,SUM(I41,L41)),-LEN(EVEN(MAX(B41,SUM(I41,L41))))+2)/5))+1)*5","v":1000},0,{"$f":"IF(F41=\"Sum\",SUM(OFFSET(A5,0,YTDBeg,1,YTDWidth)),AVERAGE(OFFSET(A5,0,YTDBeg,1,YTDWidth)))","v":494},0,0,{"$f":"IF(F41=\"Sum\",Projection*(I41/YTDWidth*12-I41),0)","v":0},0,{"$f":"B41*D41","v":837},{"$f":"((I41+L41<=N41)*(N41-(I41+L41)))","v":343},{"$f":"N41","v":837},{"$f":"(E41-D41)*B41","v":126.00000000000001},{"$f":"((I41+L41<=N41+Q41)*((N41+Q41)-(I41+L41+O41)))","v":126},{"$f":"Q41","v":126.00000000000001},{"$f":"IF(F41=\"Sum\",SUM(OFFSET(A5,0,YTDBeg-12,1,YTDWidth)),AVERAGE(OFFSET(A5,0,YTDBeg-12,1,YTDWidth)))","v":549},{"$f":"T41","v":549},1,2]
[{"$f":"A6","v":"Vehicles Serviced (Other)"},10,"More",0.85,1,"Sum",{"$f":"ROUNDUP((ROUNDUP(MAX(B42,SUM(I42,L42)),-LEN(EVEN(MAX(B42,SUM(I42,L42))))+2)/5),-LEN(EVEN(ROUNDUP(MAX(B42,SUM(I42,L42)),-LEN(EVEN(MAX(B42,SUM(I42,L42))))+2)/5))+1)*5","v":25},0,21,0,0,0,0,8.5,{"$f":"((I42+L42<=N42)*(N42-(I42+L42)))","v":0},{"$f":"N42","v":8.5},1.5000000000000002,{"$f":"((I42+L42<=N42+Q42)*((N42+Q42)-(I42+L42+O42)))","v":0},{"$f":"Q42","v":1.5000000000000002},8,{"$f":"T42","v":8},1,2]
["Billable Hours (City)",1700,"Middle",0.93,1.07,"Sum",2000,0,1004.85,0,0,0,0,1581,576.15,1581,238.00000000000003,238,238.00000000000003,1012.85,1012.85,1,2]
["Billable Hours (Other)",25,"More",0.85,1,"Sum",40,0,39.5,0,0,0,0,21.25,0,21.25,3.7500000000000004,0,3.7500000000000004,21,21,1,2]
["Billable Hours/Hours Paid",0.25,"More",0.85,1.1000000000000001,"Average",1,0,0.25477033337084348,0,0,0,0,0.21249999999999999,0,0.21249999999999999,6.2500000000000028E-2,2.022966662915654E-2,6.2500000000000028E-2,0.16658473288547665,0.16658473288547665,1,2]
["Diesel Fuel Sold (City Only)",70000,"Less",1,1.1499999999999999,"Sum",100000,0,43413.799999999996,0,0,0,0,70000,26586.200000000004,70000,10499.999999999995,10500,10499.999999999995,42137.75,42137.75,1,2]
["Diesel Fuel Sold (Other)",50800,"More",0.85,1,"Sum",100000,0,31589,0,0,0,0,43180,11591,43180,7620.0000000000009,7620,7620.0000000000009,29774.6,29774.6,1,2]
["Unleaded Fuel Sold (City Only)",130000,"Less",1,1.1499999999999999,"Sum",150000,0,78713.650000000009,0,0,0,0,130000,51286.349999999991,130000,19499.999999999989,19500,19499.999999999989,79771.100000000006,79771.100000000006,1,2]
["Unleaded Fuel Sold (Other)",7800,"More",0.85,1,"Sum",10000,0,5879.05,0,0,0,0,6630,750.94999999999982,6630,1170.0000000000002,1170,1170.0000000000002,4384.8,4384.8,1,2]
[]
[]
[]
[]
[]
[]
[]
[]
[]
[]
[]
[]
[]
[]
[]
["SPARKLINE SOURCE"]
[null,11,10,9,8,7,6,5,4,3,2,1,0]
["Measure",{"$f":"OFFSET($A4,0,CurrentMonthCount-B$66,1,1)","v":"2011-02-01"},"2011-03-01","2011-04-01","2011-05-01","2011-06-01","2011-07-01","2011-08-01","2011-09-01","2011-10-01","2011-11-01","2011-12-01","2012-01-01"]
[{"$f":"A5","v":"Vehicles Serviced (City)"},{"$f":"OFFSET($A5,0,CurrentMonthCount-B$66,1,1)","v":75},87,81,73,78,83,69,62,47,87,76,70]
[{"$f":"A6","v":"Vehicles Serviced (Other)"},{"$f":"OFFSET($A6,0,CurrentMonthCount-B$66,1,1)","v":0},1,1,0,2,3,2,3,3,1,4,5]
["Billable Hours (City)",{"$f":"OFFSET($A7,0,CurrentMonthCount-B$66,1,1)","v":145.1},146.80000000000001,137.75,145.4,112.05,153,112.75,125.5,95.2,174,164,180.4]
["Billable Hours (Other)",{"$f":"OFFSET($A8,0,CurrentMonthCount-B$66,1,1)","v":0},1,2,0,3,6.75,2,3.25,7,1,6.25,13.25]
["Billable Hours/Hours Paid",{"$f":"OFFSET($A9,0,CurrentMonthCount-B$66,1,1)","v":0.18137499999999998},0.18475,0.1746875,0.18174999999999999,9.5875000000000002E-2,0.23772321428571427,0.17929687499999999,0.201171875,0.15968750000000001,0.2734375,0.19415870264352347,0.53791666666666671]
["Diesel Fuel Sold (City Only)",{"$f":"OFFSET($A10,0,CurrentMonthCount-B$66,1,1)","v":5685.7},6873.05,6334.45,6546.45,7067.2,6868.7,7338.65,6281.25,5979.5,5907.25,5834.95,5203.5]
["Diesel Fuel Sold (Other)",{"$f":"OFFSET($A11,0,CurrentMonthCount-B$66,1,1)","v":6224.7},7082.55,4337.55,4369.7,926.35,407.8,5211.6000000000004,6030.55,5379.8,5090.8500000000004,3552.95,5915.45]
["Unleaded Fuel Sold (City Only)",{"$f":"OFFSET($A12,0,CurrentMonthCount-B$66,1,1)","v":11009.85},12764.1,11212.2,11667.45,12328.2,11469.75,12650.6,11181.1,11275.05,10587.8,10533.35,11016]
["Unleaded Fuel Sold (Other)",{"$f":"OFFSET($A13,0,CurrentMonthCount-B$66,1,1)","v":889.9},983.05,766.7,871.5,895.1,743.25,1081.7,1011.35,845.7,811.65,480.6,904.8]
[0,{"$f":"OFFSET($A14,0,CurrentMonthCount-B$66,1,1)","v":0},0,0,0,0,0,0,0,0,0,0,0]
[0,{"$f":"OFFSET($A15,0,CurrentMonthCount-B$66,1,1)","v":0},0,0,0,0,0,0,0,0,0,0,0]
[0,{"$f":"OFFSET($A16,0,CurrentMonthCount-B$66,1,1)","v":0},0,0,0,0,0,0,0,0,0,0,0]
[0,{"$f":"OFFSET($A17,0,CurrentMonthCount-B$66,1,1)","v":0},0,0,0,0,0,0,0,0,0,0,0]
[0,{"$f":"OFFSET($A18,0,CurrentMonthCount-B$66,1,1)","v":0},0,0,0,0,0,0,0,0,0,0,0]
[0,{"$f":"OFFSET($A19,0,CurrentMonthCount-B$66,1,1)","v":0},0,0,0,0,0,0,0,0,0,0,0]
[0,{"$f":"OFFSET($A20,0,CurrentMonthCount-B$66,1,1)","v":0},0,0,0,0,0,0,0,0,0,0,0]
[0,{"$f":"OFFSET($A21,0,CurrentMonthCount-B$66,1,1)","v":0},0,0,0,0,0,0,0,0,0,0,0]
[0,{"$f":"OFFSET($A22,0,CurrentMonthCount-B$66,1,1)","v":0},0,0,0,0,0,0,0,0,0,0,0]
[0,{"$f":"OFFSET($A23,0,CurrentMonthCount-B$66,1,1)","v":0},0,0,0,0,0,0,0,0,0,0,0]
[0,{"$f":"OFFSET($A24,0,CurrentMonthCount-B$66,1,1)","v":0},0,0,0,0,0,0,0,0,0,0,0]

{"sheet":"Electric","index":19,"n_rows":11,"n_cols":9,"rows_kept":11,"cut":false,"hidden":false,"merged":[]}
[{"$f":"CurrentMonth","v":"2012-01-01"},null,null,null,"ELECTRIC"]
[]
["Service","Last 12 Months","Fiscal Year to Date","FYTD",null,"Conservation","Last 12 Months","Fiscal Year to Date","FYTD"]
[{"$f":"'Electric Data'!A5","v":"Residential kWh Consumption"},null,null,{"$f":"'Electric Data'!I41","v":46749857},null,{"$f":"'Electric Data'!A13","v":"Pole Inspections Completed"},null,null,{"$f":"'Electric Data'!I49","v":248}]
[{"$f":"'Electric Data'!A6","v":"Commercial kWh Consumption"},null,null,{"$f":"'Electric Data'!I42","v":77666920},null,{"$f":"'Electric Data'!A14","v":"Walk-thru Energy Audits Performed"},null,null,{"$f":"'Electric Data'!I50","v":0}]
[{"$f":"'Electric Data'!A7","v":"Industrial kWh Consumption"},null,null,{"$f":"'Electric Data'!I43","v":195969660},null,{"$f":"'Electric Data'!A15","v":"Home Performance Inspections Performed"},null,null,{"$f":"'Electric Data'!I51","v":3}]
[{"$f":"'Electric Data'!A8","v":"Government kWh Consumption"},null,null,{"$f":"'Electric Data'!I44","v":5909839},null,{"$f":"'Electric Data'!A16","v":"Grant Dollars Paid Out"},null,null,{"$f":"'Electric Data'!I52","v":3361.5}]
[{"$f":"'Electric Data'!A9","v":"External Source Service Outages"},null,null,{"$f":"'Electric Data'!I45","v":8.2857142857142865}]
[{"$f":"'Electric Data'!A10","v":"System Failure Service Outages"},null,null,{"$f":"'Electric Data'!I46","v":10}]
[{"$f":"'Electric Data'!A11","v":"Average Residential Rate per kWh (₵/kWh)"},null,null,{"$f":"'Electric Data'!I47","v":10.365714285714287}]
[{"$f":"'Electric Data'!A12","v":"Georgia Power Residential Rate (₵/kWh)"},null,"Data History Not Sufficient at this time to show year to date average.",{"$f":"'Electric Data'!I48","v":{"$error":"#N/A"}}]

{"sheet":"Electric Data","index":20,"n_rows":100,"n_cols":44,"rows_kept":100,"cut":false,"hidden":true,"merged":[]}
["Electric Data"]
[]
[]
["Measure","2008-07-01","2008-08-01","2008-09-01","2008-10-01","2008-11-01","2008-12-01","2009-01-01","2009-02-01","2009-03-01","2009-04-01","2009-05-01","2009-06-01","2009-07-01","2009-08-01","2009-09-01","2009-10-01","2009-11-01","2009-12-01","2010-01-01","2010-02-01","2010-03-01","2010-04-01","2010-05-01","2010-06-01","2010-07-01","2010-08-01","2010-09-01","2010-10-01","2010-11-01","2010-12-01","2011-01-01","2011-02-01","2011-03-01","2011-04-01","2011-05-01","2011-06-01","2011-07-01","2011-08-01","2011-09-01","2011-10-01","2011-11-01","2011-12-01","2012-01-01"]
["Residential kWh Consumption",{"$error":"#N/A"},{"$error":"#N/A"},{"$error":"#N/A"},{"$error":"#N/A"},{"$error":"#N/A"},{"$error":"#N/A"},{"$error":"#N/A"},{"$error":"#N/A"},{"$error":"#N/A"},{"$error":"#N/A"},{"$error":"#N/A"},{"$error":"#N/A"},{"$error":"#N/A"},{"$error":"#N/A"},{"$error":"#N/A"},{"$error":"#N/A"},{"$error":"#N/A"},{"$error":"#N/A"},7318207,6578603,6306679,5054174,5021152,7198923,8980221,10043885,8640912,5480721,4245457,6256779,7765875,6247443,4976173,4917322,4974377,7460630,8679712,9796817,7990180,4737769,4160603,5205533,6179243]
["Commercial kWh Consumption",{"$error":"#N/A"},{"$error":"#N/A"},{"$error":"#N/A"},{"$error":"#N/A"},{"$error":"#N/A"},{"$error":"#N/A"},{"$error":"#N/A"},{"$error":"#N/A"},{"$error":"#N/A"},{"$error":"#N/A"},{"$error":"#N/A"},{"$error":"#N/A"},{"$error":"#N/A"},{"$error":"#N/A"},{"$error":"#N/A"},{"$error":"#N/A"},{"$error":"#N/A"},{"$error":"#N/A"},9774539,9783585,9419976,9402240,9542341,11055747,12544575,12990975,12543685,10446406,9283475,9982117,10797628,10069865,9282912,9795992,10358156,11608316,12647902,13883481,12901070,10263480,9058363,9044524,9868100]
["Industrial kWh Consumption",{"$error":"#N/A"},{"$error":"#N/A"},{"$error":"#N/A"},{"$error":"#N/A"},{"$error":"#N/A"},{"$error":"#N/A"},{"$error":"#N/A"},{"$error":"#N/A"},{"$error":"#N/A"},{"$error":"#N/A"},{"$error":"#N/A"},{"$error":"#N/A"},{"$error":"#N/A"},{"$error":"#N/A"},{"$error":"#N/A"},{"$error":"#N/A"},{"$error":"#N/A"},{"$error":"#N/A"},25725710,27448260,24697530,27729540,26731180,29117170,29585500,30082760,30178320,27583620,26192980,24691600,24076160,20292440,22853360,25318560,27390440,28888900,28863880,28898000,30540260,28906340,28722760,25307640,24730780]
["Government kWh Consumption",{"$error":"#N/A"},{"$error":"#N/A"},{"$error":"#N/A"},{"$error":"#N/A"},{"$error":"#N/A"},{"$error":"#N/A"},{"$error":"#N/A"},{"$error":"#N/A"},{"$error":"#N/A"},{"$error":"#N/A"},{"$error":"#N/A"},{"$error":"#N/A"},{"$error":"#N/A"},{"$error":"#N/A"},{"$error":"#N/A"},{"$error":"#N/A"},{"$error":"#N/A"},{"$error":"#N/A"},945567,891949,886745,805502,801436,697917,792606,1070827,1086505,857432,733883,868309,896544,953965,834762,786368,781724,728534,740015,1035400,1077812,803053,708284,746077,799198]
["External Source Service Outages",{"$error":"#N/A"},{"$error":"#N/A"},{"$error":"#N/A"},{"$error":"#N/A"},{"$error":"#N/A"},{"$error":"#N/A"},{"$error":"#N/A"},{"$error":"#N/A"},{"$error":"#N/A"},{"$error":"#N/A"},{"$error":"#N/A"},{"$error":"#N/A"},{"$error":"#N/A"},{"$error":"#N/A"},{"$error":"#N/A"},{"$error":"#N/A"},{"$error":"#N/A"},{"$error":"#N/A"},{"$error":"#N/A"},{"$error":"#N/A"},{"$error":"#N/A"},{"$error":"#N/A"},{"$error":"#N/A"},{"$error":"#N/A"},{"$error":"#N/A"},{"$error":"#N/A"},{"$error":"#N/A"},{"$error":"#N/A"},{"$error":"#N/A"},{"$error":"#N/A"},{"$error":"#N/A"},{"$error":"#N/A"},{"$error":"#N/A"},{"$error":"#N/A"},{"$error":"#N/A"},{"$error":"#N/A"},27,15,2,4,5,3,2]
["System Failure Service Outages",{"$error":"#N/A"},{"$error":"#N/A"},{"$error":"#N/A"},{"$error":"#N/A"},{"$error":"#N/A"},{"$error":"#N/A"},{"$error":"#N/A"},{"$error":"#N/A"},{"$error":"#N/A"},{"$error":"#N/A"},{"$error":"#N/A"},{"$error":"#N/A"},{"$error":"#N/A"},{"$error":"#N/A"},{"$error":"#N/A"},{"$error":"#N/A"},{"$error":"#N/A"},{"$error":"#N/A"},{"$error":"#N/A"},{"$error":"#N/A"},{"$error":"#N/A"},{"$error":"#N/A"},{"$error":"#N/A"},{"$error":"#N/A"},{"$error":"#N/A"},{"$error":"#N/A"},{"$error":"#N/A"},{"$error":"#N/A"},{"$error":"#N/A"},{"$error":"#N/A"},{"$error":"#N/A"},{"$error":"#N/A"},{"$error":"#N/A"},{"$error":"#N/A"},{"$error":"#N/A"},{"$error":"#N/A"},0,2,0,1,1,4,2]
["Average Residential Rate per kWh (₵/kWh)",{"$error":"#N/A"},{"$error":"#N/A"},{"$error":"#N/A"},{"$error":"#N/A"},{"$error":"#N/A"},{"$error":"#N/A"},{"$error":"#N/A"},{"$error":"#N/A"},{"$error":"#N/A"},{"$error":"#N/A"},{"$error":"#N/A"},{"$error":"#N/A"},{"$error":"#N/A"},{"$error":"#N/A"},{"$error":"#N/A"},{"$error":"#N/A"},{"$error":"#N/A"},{"$error":"#N/A"},9.06,9.06,8.9600000000000009,8.9600000000000009,8.9600000000000009,9.8699999999999992,9.9600000000000009,9.9600000000000009,9.9600000000000009,9.0500000000000007,9.15,9.15,9.3699999999999992,9.56,9.7100000000000009,9.85,10.01,11.12,10.81,10.81,10.81,9.9600000000000009,10.02,9.9600000000000009,10.19]
["Georgia Power Residential Rate (₵/kWh)",{"$error":"#N/A"},{"$error":"#N/A"},{"$error":"#N/A"},{"$error":"#N/A"},{"$error":"#N/A"},{"$error":"#N/A"},{"$error":"#N/A"},{"$error":"#N/A"},{"$error":"#N/A"},{"$error":"#N/A"},{"$error":"#N/A"},{"$error":"#N/A"},{"$error":"#N/A"},{"$error":"#N/A"},{"$error":"#N/A"},{"$error":"#N/A"},{"$error":"#N/A"},{"$error":"#N/A"},{"$error":"#N/A"},{"$error":"#N/A"},{"$error":"#N/A"},{"$error":"#N/A"},{"$error":"#N/A"},{"$error":"#N/A"},{"$error":"#N/A"},{"$error":"#N/A"},{"$error":"#N/A"},{"$error":"#N/A"},{"$error":"#N/A"},{"$error":"#N/A"},{"$error":"#N/A"},{"$error":"#N/A"},{"$error":"#N/A"},{"$error":"#N/A"},{"$error":"#N/A"},{"$error":"#N/A"},{"$error":"#N/A"},{"$error":"#N/A"},{"$error":"#N/A"},{"$error":"#N/A"},{"$error":"#N/A"},11.73,11.04]
["Pole Inspections Completed",{"$error":"#N/A"},{"$error":"#N/A"},{"$error":"#N/A"},{"$error":"#N/A"},{"$error":"#N/A"},{"$error":"#N/A"},{"$error":"#N/A"},{"$error":"#N/A"},{"$error":"#N/A"},{"$error":"#N/A"},{"$error":"#N/A"},{"$error":"#N/A"},{"$error":"#N/A"},{"$error":"#N/A"},{"$error":"#N/A"},{"$error":"#N/A"},{"$error":"#N/A"},{"$error":"#N/A"},{"$error":"#N/A"},{"$error":"#N/A"},{"$error":"#N/A"},{"$error":"#N/A"},{"$error":"#N/A"},{"$error":"#N/A"},{"$error":"#N/A"},{"$error":"#N/A"},{"$error":"#N/A"},{"$error":"#N/A"},{"$error":"#N/A"},{"$error":"#N/A"},{"$error":"#N/A"},{"$error":"#N/A"},{"$error":"#N/A"},{"$error":"#N/A"},{"$error":"#N/A"},{"$error":"#N/A"},36,29,42,31,64,0,46]
["Walk-thru Energy Audits Performed",{"$error":"#N/A"},{"$error":"#N/A"},{"$error":"#N/A"},{"$error":"#N/A"},{"$error":"#N/A"},{"$error":"#N/A"},{"$error":"#N/A"},{"$error":"#N/A"},{"$error":"#N/A"},{"$error":"#N/A"},{"$error":"#N/A"},{"$error":"#N/A"},{"$error":"#N/A"},{"$error":"#N/A"},{"$error":"#N/A"},{"$error":"#N/A"},{"$error":"#N/A"},{"$error":"#N/A"},{"$error":"#N/A"},{"$error":"#N/A"},{"$error":"#N/A"},{"$error":"#N/A"},{"$error":"#N/A"},{"$error":"#N/A"},{"$error":"#N/A"},{"$error":"#N/A"},{"$error":"#N/A"},{"$error":"#N/A"},{"$error":"#N/A"},{"$error":"#N/A"},{"$error":"#N/A"},{"$error":"#N/A"},{"$error":"#N/A"},{"$error":"#N/A"},{"$error":"#N/A"},{"$error":"#N/A"},0,0,0,0,0,0,0]
["Home Performance Inspections Performed",{"$error":"#N/A"},{"$error":"#N/A"},{"$error":"#N/A"},{"$error":"#N/A"},{"$error":"#N/A"},{"$error":"#N/A"},{"$error":"#N/A"},{"$error":"#N/A"},{"$error":"#N/A"},{"$error":"#N/A"},{"$error":"#N/A"},{"$error":"#N/A"},{"$error":"#N/A"},{"$error":"#N/A"},{"$error":"#N/A"},{"$error":"#N/A"},{"$error":"#N/A"},{"$error":"#N/A"},{"$error":"#N/A"},{"$error":"#N/A"},{"$error":"#N/A"},{"$error":"#N/A"},{"$error":"#N/A"},{"$error":"#N/A"},{"$error":"#N/A"},{"$error":"#N/A"},{"$error":"#N/A"},{"$error":"#N/A"},{"$error":"#N/A"},{"$error":"#N/A"},{"$error":"#N/A"},{"$error":"#N/A"},{"$error":"#N/A"},{"$error":"#N/A"},{"$error":"#N/A"},{"$error":"#N/A"},2,0,0,0,0,1,0]
["Grant Dollars Paid Out",{"$error":"#N/A"},{"$error":"#N/A"},{"$error":"#N/A"},{"$error":"#N/A"},{"$error":"#N/A"},{"$error":"#N/A"},{"$error":"#N/A"},{"$error":"#N/A"},{"$error":"#N/A"},{"$error":"#N/A"},{"$error":"#N/A"},{"$error":"#N/A"},{"$error":"#N/A"},{"$error":"#N/A"},{"$error":"#N/A"},{"$error":"#N/A"},{"$error":"#N/A"},{"$error":"#N/A"},{"$error":"#N/A"},{"$error":"#N/A"},{"$error":"#N/A"},{"$error":"#N/A"},{"$error":"#N/A"},{"$error":"#N/A"},{"$error":"#N/A"},{"$error":"#N/A"},{"$error":"#N/A"},{"$error":"#N/A"},{"$error":"#N/A"},{"$error":"#N/A"},{"$error":"#N/A"},{"$error":"#N/A"},{"$error":"#N/A"},{"$error":"#N/A"},{"$error":"#N/A"},{"$error":"#N/A"},499,0,629.5,1453.5,0,779.5,0]
[]
[]
[]
[]
[]
[]
[]
[]
[]
[]
["HIGHLIGHTS","2008-07-01","2008-08-01","2008-09-01","2008-10-01","2008-11-01","2008-12-01","2009-01-01","2009-02-01","2009-03-01","2009-04-01","2009-05-01","2009-06-01","2009-07-01","2009-08-01","2009-09-01","2009-10-01","2009-11-01","2009-12-01","2010-01-01","2010-02-01","2010-03-01","2010-04-01","2010-05-01","2010-06-01","2010-07-01","2010-08-01","2010-09-01","2010-10-01","2010-11-01","2010-12-01","2011-01-01","2011-02-01","2011-03-01","2011-04-01","2011-05-01","2011-06-01","2011-07-01","2011-08-01","2011-09-01","2011-10-01","2011-11-01","2011-12-01","2012-01-01"]
["Highlight 1",null,null,null,null,null,null,null,null,null,null,null,null,null,null,null,null,null,null,null,null,null,null,null,null,null,null,null,null,null,null,null,null,null,null,null,null,"1.  Heavy lightning storms during the month of July caused several service outages.","1. Storm crews were sent to Robersonville, NC to restore power in the aftermath of Hurricane Irene.","1.  Cost of Service study commenced.  When complete, data will be used for rate adjustment.","Cost of Service study in progress.","Cost of Service study complete.","Georgia Residential Energy Efficiency Grant complete.","Georgia Highlands College expansion job complete."]
["Highlight 2",null,null,null,null,null,null,null,null,null,null,null,null,null,null,null,null,null,null,null,null,null,null,null,null,null,null,null,null,null,null,null,null,null,null,null,null,null,"2. Heavy lighting storms caused 15 service outages this month.","2.  Provided trucks/equipment to Pre-K School for \"Transportation Day.\"","Recloser installation in progress.","Recloser installation in progress.","Georgia Highlands College expansion job in progress.","Recloser installation project complete."]
["Highlight 3",null,null,null,null,null,null,null,null,null,null,null,null,null,null,null,null,null,null,null,null,null,null,null,null,null,null,null,null,null,null,null,null,null,null,null,null,null,null,"3.  Provided trucks/equipment to Primary School for \"Community Helpers Day.\"","North Erwin Street pole change out project in progress.","North Erwin Street pole change out project in progress.","Public Safety Center job in progress.","Chemical Products contract job complete."]
["Highlight 4",null,null,null,null,null,null,null,null,null,null,null,null,null,null,null,null,null,null,null,null,null,null,null,null,null,null,null,null,null,null,null,null,null,null,null,null,null,null,"4.  Recloser installation commenced to minimize number of customers out during an event.","Pole hardware inspection project in progress.","Pole hardware inspection project in progress.","Recloser installation in progress.","Linde Gas open records request and COS review in progress."]
["Highlight 5",null,null,null,null,null,null,null,null,null,null,null,null,null,null,null,null,null,null,null,null,null,null,null,null,null,null,null,null,null,null,null,null,null,null,null,null,null,null,"5.  North Erwin Street pole change out project started due to deteriorated poles, new poles placed behind sidewalk.","System grounding project complete.","Pole Treatment contractor complete.","North Erwin Street pole change out project in progress.","Public Safety Center job in progress."]
["Highlight 6",null,null,null,null,null,null,null,null,null,null,null,null,null,null,null,null,null,null,null,null,null,null,null,null,null,null,null,null,null,null,null,null,null,null,null,null,null,null,"6.  Pole hardware inspection project continues.","Hurt man/pole top/bucket rescue training completed.","ECG/State of Georgia Economic Development Bus Tour","Pole hardware inspection project in progress.","North Erwin Street pole change out project in progress."]
["Highlight 7",null,null,null,null,null,null,null,null,null,null,null,null,null,null,null,null,null,null,null,null,null,null,null,null,null,null,null,null,null,null,null,null,null,null,null,null,null,null,"7.  System grounding project continues.","Electric Cities of Georgia Safety Award received.","Decorated Christmas Tree downtown",null,"Pole hardware inspection project in progress."]
["Highlight 8",null,null,null,null,null,null,null,null,null,null,null,null,null,null,null,null,null,null,null,null,null,null,null,null,null,null,null,null,null,null,null,null,null,null,null,null,null,null,"8.  Plant Vogtle expansion construction currently on schedule and on budget.","Pole Treatment contractor commenced (using 4-wheelers)",null,null,"Material ordered for Main Street Gateway project."]
["Highlights Concaetenation",{"$f":"B28&CHAR(10)&B29&CHAR(10)&B30&CHAR(10)&B31&CHAR(10)&B32&CHAR(10)&B33&CHAR(10)&B34&CHAR(10)&B35","v":"\n\n\n\n\n\n\n"},{"$f":"C28&CHAR(10)&C29&CHAR(10)&C30&CHAR(10)&C31&CHAR(10)&C32&CHAR(10)&C33&CHAR(10)&C34&CHAR(10)&C35","v":"\n\n\n\n\n\n\n"},"\n\n\n\n\n\n\n","\n\n\n\n\n\n\n","\n\n\n\n\n\n\n","\n\n\n\n\n\n\n","\n\n\n\n\n\n\n","\n\n\n\n\n\n\n","\n\n\n\n\n\n\n","\n\n\n\n\n\n\n","\n\n\n\n\n\n\n","\n\n\n\n\n\n\n","\n\n\n\n\n\n\n","\n\n\n\n\n\n\n","\n\n\n\n\n\n\n","\n\n\n\n\n\n\n","\n\n\n\n\n\n\n","\n\n\n\n\n\n\n","\n\n\n\n\n\n\n","\n\n\n\n\n\n\n","\n\n\n\n\n\n\n","\n\n\n\n\n\n\n","\n\n\n\n\n\n\n","\n\n\n\n\n\n\n","\n\n\n\n\n\n\n","\n\n\n\n\n\n\n","\n\n\n\n\n\n\n","\n\n\n\n\n\n\n","\n\n\n\n\n\n\n","\n\n\n\n\n\n\n","\n\n\n\n\n\n\n","\n\n\n\n\n\n\n","\n\n\n\n\n\n\n","\n\n\n\n\n\n\n","\n\n\n\n\n\n\n",{"$f":"AK28&CHAR(10)&CHAR(10)&AK29&CHAR(10)&CHAR(10)&AK30&CHAR(10)&CHAR(10)&AK31&CHAR(10)&CHAR(10)&AK32&CHAR(10)&CHAR(10)&AK33&CHAR(10)&CHAR(10)&AK34&CHAR(10)&CHAR(10)&AK35","v":"\n\n\n\n\n\n\n\n\n\n\n\n\n\n"},"1.  Heavy lightning storms during the month of July caused several service outages.\n\n\n\n\n\n\n\n\n\n\n\n\n\n","1. Storm crews were sent to Robersonville, NC to restore power in the aftermath of Hurricane Irene.\n\n2. Heavy lighting storms caused 15 service outages this month.\n\n\n\n\n\n\n\n\n\n\n\n","1.  Cost of Service study commenced.  When complete, data will be used for rate adjustment.\n\n2.  Provided trucks/equipment to Pre-K School for \"Transportation Day.\"\n\n3.  Provided trucks/equipment to Primary School for \"Community Helpers Day.\"\n\n4.  Recloser installation commenced to minimize number of customers out during an event.\n\n5.  North Erwin Street pole change out project started due to deteriorated poles, new poles placed behind sidewalk.\n\n6.  Pole hardware inspection project continues.\n\n7.  System grounding project continues.\n\n8.  Plant Vogtle expansion construction currently on schedule and on budget.","Cost of Service study in progress.\n\nRecloser installation in progress.\n\nNorth Erwin Street pole change out project in progress.\n\nPole hardware inspection project in progress.\n\nSystem grounding project complete.\n\nHurt man/pole top/bucket rescue training completed.\n\nElectric Cities of Georgia Safety Award received.\n\nPole Treatment contractor commenced (using 4-wheelers)","Cost of Service study complete.\n\nRecloser installation in progress.\n\nNorth Erwin Street pole change out project in progress.\n\nPole hardware inspection project in progress.\n\nPole Treatment contractor complete.\n\nECG/State of Georgia Economic Development Bus Tour\n\nDecorated Christmas Tree downtown\n\n","Georgia Residential Energy Efficiency Grant complete.\n\nGeorgia Highlands College expansion job in progress.\n\nPublic Safety Center job in progress.\n\nRecloser installation in progress.\n\nNorth Erwin Street pole change out project in progress.\n\nPole hardware inspection project in progress.\n\n\n\n","Georgia Highlands College expansion job complete.\n\nRecloser installation project complete.\n\nChemical Products contract job complete.\n\nLinde Gas open records request and COS review in progress.\n\nPublic Safety Center job in progress.\n\nNorth Erwin Street pole change out project in progress.\n\nPole hardware inspection project in progress.\n\nMaterial ordered for Main Street Gateway project."]
[]
[]
[]
["Bullet Chart Source","Target","What's Better?","Band 1","Band 2","YTD Type","Max Scale","Actual 1","Actual","Actual 3","Projection 1","Projection 2","Projection 3","First Zone 1","First Zone 2","First Zone 3","Second Zone 1","Second Zone 2","Second Zone 3","Previous X 1","Previous X 2","Previous Y 1","Previous Y 2"]
[{"$f":"A5","v":"Residential kWh Consumption"},81125713,"More",0.85,1,"Sum",{"$f":"ROUNDUP((ROUNDUP(MAX(B41,SUM(I41,L41)),-LEN(EVEN(MAX(B41,SUM(I41,L41))))+2)/5),-LEN(EVEN(ROUNDUP(MAX(B41,SUM(I41,L41)),-LEN(EVEN(MAX(B41,SUM(I41,L41))))+2)/5))+1)*5","v":100000000},0,{"$f":"IF(F41=\"Sum\",SUM(OFFSET(A5,0,YTDBeg,1,YTDWidth)),AVERAGE(OFFSET(A5,0,YTDBeg,1,YTDWidth)))","v":46749857},0,0,{"$f":"IF(F41=\"Sum\",Projection*(I41/YTDWidth*12-I41),0)","v":0},0,{"$f":"B41*D41","v":68956856.049999997},{"$f":"((I41+L41<=N41)*(N41-(I41+L41)))","v":22206999.049999997},{"$f":"N41","v":68956856.049999997},{"$f":"(E41-D41)*B41","v":12168856.950000001},{"$f":"((I41+L41<=N41+Q41)*((N41+Q41)-(I41+L41+O41)))","v":12168856.950000003},{"$f":"Q41","v":12168856.950000001},{"$f":"IF(F41=\"Sum\",SUM(OFFSET(A5,0,YTDBeg-12,1,YTDWidth)),AVERAGE(OFFSET(A5,0,YTDBeg-12,1,YTDWidth)))","v":51413850},{"$f":"T41","v":51413850},1,2]
[{"$f":"A6","v":"Commercial kWh Consumption"},126769661,"More",0.85,1,"Sum",{"$f":"ROUNDUP((ROUNDUP(MAX(B42,SUM(I42,L42)),-LEN(EVEN(MAX(B42,SUM(I42,L42))))+2)/5),-LEN(EVEN(ROUNDUP(MAX(B42,SUM(I42,L42)),-LEN(EVEN(MAX(B42,SUM(I42,L42))))+2)/5))+1)*5","v":150000000},0,77666920,0,0,0,0,107754211.84999999,{"$f":"((I42+L42<=N42)*(N42-(I42+L42)))","v":30087291.849999994},{"$f":"N42","v":107754211.84999999},19015449.150000002,{"$f":"((I42+L42<=N42+Q42)*((N42+Q42)-(I42+L42+O42)))","v":19015449.150000006},{"$f":"Q42","v":19015449.150000002},78588861,{"$f":"T42","v":78588861},1,2]
["Industrial kWh Consumption",329764170,"More",0.85,1,"Sum",350000000,0,195969660,0,0,0,0,280299544.5,84329884.5,280299544.5,49464625.500000007,49464625.5,49464625.500000007,192390940,192390940,1,2]
["Government kWh Consumption",10436878,"Less",1,1.1499999999999999,"Sum",15000000,0,5909839,0,0,0,0,10436878,4527039,10436878,1565531.699999999,1565531.6999999993,1565531.699999999,6306106,6306106,1,2]
["External Source Service Outages",0,"Less",1,1.1499999999999999,"Average",10,0,8.2857142857142865,0,0,0,0,0,0,0,0,0,0,{"$error":"#N/A"},{"$error":"#N/A"},1,2]
["System Failure Service Outages",0,"Less",1,1.1499999999999999,"Sum",10,0,10,0,0,0,0,0,0,0,0,0,0,{"$error":"#N/A"},{"$error":"#N/A"},1,2]
["Average Residential Rate per kWh (₵/kWh)",9.34,"Less",1,1.1499999999999999,"Average",15,0,10.365714285714287,0,0,0,0,9.34,0,9.34,1.4009999999999991,0.37528571428571311,1.4009999999999991,9.514285714285716,9.514285714285716,1,2]
["Georgia Power Residential Rate (₵/kWh)",{"$f":"B47","v":9.34},"More",0.85,1,"Average",{"$error":"#N/A"},0,{"$error":"#N/A"},0,0,0,0,7.9390000000000001,{"$error":"#N/A"},7.9390000000000001,1.4010000000000002,{"$error":"#N/A"},1.4010000000000002,{"$error":"#N/A"},{"$error":"#N/A"},1,2]
["Pole Inspections Completed",500,"Middle",0.93,1.07,"Sum",500,0,248,0,0,0,0,465,217,465,70,70,70,{"$error":"#N/A"},{"$error":"#N/A"},1,2]
["Walk-thru Energy Audits Performed",15,"More",0.85,1,"Sum",{"$f":"ROUNDUP((ROUNDUP(MAX(B50,SUM(I50,L50)),-LEN(EVEN(MAX(B50,SUM(I50,L50))))+2)/5),-LEN(EVEN(ROUNDUP(MAX(B50,SUM(I50,L50)),-LEN(EVEN(MAX(B50,SUM(I50,L50))))+2)/5))+1)*5","v":15},0,0,0,0,0,0,{"$f":"B50*D50","v":12.75},{"$f":"((I50+L50<=N50)*(N50-(I50+L50)))","v":12.75},{"$f":"N50","v":12.75},{"$f":"(E50-D50)*B50","v":2.2500000000000004},{"$f":"((I50+L50<=N50+Q50)*((N50+Q50)-(I50+L50+O50)))","v":2.25},{"$f":"Q50","v":2.2500000000000004},{"$error":"#N/A"},{"$f":"T50","v":{"$error":"#N/A"}},1,2]
["Home Performance Inspections Performed",18,"More",0.85,1,"Sum",20,0,3,0,0,0,0,15.299999999999999,12.299999999999999,15.299999999999999,2.7,2.7000000000000011,2.7,{"$error":"#N/A"},{"$error":"#N/A"},1,2]
[{"$f":"A16","v":"Grant Dollars Paid Out"},12500,"More",0.85,1,"Sum",15000,0,{"$f":"IF(F52=\"Sum\",SUM(OFFSET(A16,0,YTDBeg,1,YTDWidth)),AVERAGE(OFFSET(A16,0,YTDBeg,1,YTDWidth)))","v":3361.5},0,0,{"$f":"IF(F52=\"Sum\",Projection*(I52/YTDWidth*12-I52),0)","v":0},0,{"$f":"B52*D52","v":10625},{"$f":"((I52+L52<=N52)*(N52-(I52+L52)))","v":7263.5},{"$f":"N52","v":10625},{"$f":"(E52-D52)*B52","v":1875.0000000000002},{"$f":"((I52+L52<=N52+Q52)*((N52+Q52)-(I52+L52+O52)))","v":1875},{"$f":"Q52","v":1875.0000000000002},{"$f":"IF(F52=\"Sum\",SUM(OFFSET(A16,0,YTDBeg-12,1,YTDWidth)),AVERAGE(OFFSET(A16,0,YTDBeg-12,1,YTDWidth)))","v":{"$error":"#N/A"}},{"$f":"T52","v":{"$error":"#N/A"}},1,2]
[]
[]
[]
[]
[]
[]
[]
[]
[]
[]
[]
[]
["SPARKLINE SOURCE"]
[null,11,10,9,8,7,6,5,4,3,2,1,0]
["Measure",{"$f":"OFFSET($A4,0,CurrentMonthCount-B$66,1,1)","v":"2011-02-01"},"2011-03-01","2011-04-01","2011-05-01","2011-06-01","2011-07-01","2011-08-01","2011-09-01","2011-10-01","2011-11-01","2011-12-01","2012-01-01"]
[{"$f":"A5","v":"Residential kWh Consumption"},{"$f":"OFFSET($A5,0,CurrentMonthCount-B$66,1,1)","v":6247443},4976173,4917322,4974377,7460630,8679712,9796817,7990180,4737769,4160603,5205533,6179243]
[{"$f":"A6","v":"Commercial kWh Consumption"},{"$f":"OFFSET($A6,0,CurrentMonthCount-B$66,1,1)","v":10069865},9282912,9795992,10358156,11608316,12647902,13883481,12901070,10263480,9058363,9044524,9868100]
["Industrial kWh Consumption",{"$f":"OFFSET($A7,0,CurrentMonthCount-B$66,1,1)","v":20292440},22853360,25318560,27390440,28888900,28863880,28898000,30540260,28906340,28722760,25307640,24730780]
["Government kWh Consumption",{"$f":"OFFSET($A8,0,CurrentMonthCount-B$66,1,1)","v":953965},834762,786368,781724,728534,740015,1035400,1077812,803053,708284,746077,799198]
["External Source Service Outages",{"$f":"OFFSET($A9,0,CurrentMonthCount-B$66,1,1)","v":{"$error":"#N/A"}},{"$error":"#N/A"},{"$error":"#N/A"},{"$error":"#N/A"},{"$error":"#N/A"},27,15,2,4,5,3,2]
["System Failure Service Outages",{"$f":"OFFSET($A10,0,CurrentMonthCount-B$66,1,1)","v":{"$error":"#N/A"}},{"$error":"#N/A"},{"$error":"#N/A"},{"$error":"#N/A"},{"$error":"#N/A"},0,2,0,1,1,4,2]
["Average Residential Rate per kWh (₵/kWh)",{"$f":"OFFSET($A11,0,CurrentMonthCount-B$66,1,1)","v":9.56},9.7100000000000009,9.85,10.01,11.12,10.81,10.81,10.81,9.9600000000000009,10.02,9.9600000000000009,10.19]
["Georgia Power Residential Rate (₵/kWh)",{"$f":"OFFSET($A12,0,CurrentMonthCount-B$66,1,1)","v":{"$error":"#N/A"}},{"$error":"#N/A"},{"$error":"#N/A"},{"$error":"#N/A"},{"$error":"#N/A"},{"$error":"#N/A"},{"$error":"#N/A"},{"$error":"#N/A"},{"$error":"#N/A"},{"$error":"#N/A"},11.73,11.04]
["Pole Inspections Completed",{"$f":"OFFSET($A13,0,CurrentMonthCount-B$66,1,1)","v":{"$error":"#N/A"}},{"$error":"#N/A"},{"$error":"#N/A"},{"$error":"#N/A"},{"$error":"#N/A"},36,29,42,31,64,0,46]
["Walk-thru Energy Audits Performed",{"$f":"OFFSET($A14,0,CurrentMonthCount-B$66,1,1)","v":{"$error":"#N/A"}},{"$error":"#N/A"},{"$error":"#N/A"},{"$error":"#N/A"},{"$error":"#N/A"},0,0,0,0,0,0,0]
["Home Performance Inspections Performed",{"$f":"OFFSET($A15,0,CurrentMonthCount-B$66,1,1)","v":{"$error":"#N/A"}},{"$error":"#N/A"},{"$error":"#N/A"},{"$error":"#N/A"},{"$error":"#N/A"},2,0,0,0,0,1,0]
["Grant Dollars Paid Out",{"$f":"OFFSET($A16,0,CurrentMonthCount-B$66,1,1)","v":{"$error":"#N/A"}},{"$error":"#N/A"},{"$error":"#N/A"},{"$error":"#N/A"},{"$error":"#N/A"},499,0,629.5,1453.5,0,779.5,0]
[0,{"$f":"OFFSET($A17,0,CurrentMonthCount-B$66,1,1)","v":0},0,0,0,0,0,0,0,0,0,0,0]
[0,{"$f":"OFFSET($A18,0,CurrentMonthCount-B$66,1,1)","v":0},0,0,0,0,0,0,0,0,0,0,0]
[0,{"$f":"OFFSET($A19,0,CurrentMonthCount-B$66,1,1)","v":0},0,0,0,0,0,0,0,0,0,0,0]
[0,{"$f":"OFFSET($A20,0,CurrentMonthCount-B$66,1,1)","v":0},0,0,0,0,0,0,0,0,0,0,0]
[0,{"$f":"OFFSET($A21,0,CurrentMonthCount-B$66,1,1)","v":0},0,0,0,0,0,0,0,0,0,0,0]
[0,{"$f":"OFFSET($A22,0,CurrentMonthCount-B$66,1,1)","v":0},0,0,0,0,0,0,0,0,0,0,0]
[0,{"$f":"OFFSET($A23,0,CurrentMonthCount-B$66,1,1)","v":0},0,0,0,0,0,0,0,0,0,0,0]
[0,{"$f":"OFFSET($A24,0,CurrentMonthCount-B$66,1,1)","v":0},0,0,0,0,0,0,0,0,0,0,0]
[]
[]
[]
[]
[]
[]
[]
[]
[]
[]
[]
[]
["Pictures"]

{"sheet":"Gas","index":21,"n_rows":11,"n_cols":9,"rows_kept":11,"cut":false,"hidden":false,"merged":[]}
[{"$f":"CurrentMonth","v":"2012-01-01"},null,null,null,"GAS"]
[]
["Consumption","Last 12 Months","Fiscal Year to Date","FYTD",null,"Cost","Last 12 Months","Fiscal Year to Date","FYTD"]
[{"$f":"'Gas Data'!A5","v":"Residential MCF Consumption"},null,null,{"$f":"'Gas Data'!I41","v":239927},null,{"$f":"'Gas Data'!A9","v":"Price per Therm"},null,null,{"$f":"'Gas Data'!I45","v":1.337142857142857}]
[{"$f":"'Gas Data'!A6","v":"Commercial MCF Consumption"},null,null,{"$f":"'Gas Data'!I42","v":166713},null,{"$f":"'Gas Data'!A10","v":"Lowest AGL Marketer Price per Therm"},null,null,{"$f":"'Gas Data'!I46","v":1.7828571428571429}]
[{"$f":"'Gas Data'!A7","v":"Industrial MCF Consumption"},null,null,{"$f":"'Gas Data'!I43","v":1501048}]
[null,null,null,null,null,"Maintenance"]
["Reliability",null,null,null,null,{"$f":"'Gas Data'!A11","v":"Utility Locates Performed"},null,null,{"$f":"'Gas Data'!I47","v":10193}]
[{"$f":"'Gas Data'!A8","v":"Number of Service Outages"},null,null,{"$f":"'Gas Data'!I44","v":0},null,{"$f":"'Gas Data'!A12","v":"Linear Miles of Right of Way Mowed"},null,null,{"$f":"'Gas Data'!I48","v":32.159999999999997}]
[null,null,null,null,null,{"$f":"'Gas Data'!A13","v":"Service Lines Surveyed"},null,null,{"$f":"'Gas Data'!I49","v":1848}]
[null,null,null,null,null,{"$f":"'Gas Data'!A14","v":"Linear Miles of Main Surveyed"},null,null,{"$f":"'Gas Data'!I50","v":79.22}]

{"sheet":"Gas Data","index":22,"n_rows":87,"n_cols":44,"rows_kept":87,"cut":false,"hidden":false,"merged":[]}
["Gas Data"]
[]
[]
["Measure","2008-07-01","2008-08-01","2008-09-01","2008-10-01","2008-11-01","2008-12-01","2009-01-01","2009-02-01","2009-03-01","2009-04-01","2009-05-01","2009-06-01","2009-07-01","2009-08-01","2009-09-01","2009-10-01","2009-11-01","2009-12-01","2010-01-01","2010-02-01","2010-03-01","2010-04-01","2010-05-01","2010-06-01","2010-07-01","2010-08-01","2010-09-01","2010-10-01","2010-11-01","2010-12-01","2011-01-01","2011-02-01","2011-03-01","2011-04-01","2011-05-01","2011-06-01","2011-07-01","2011-08-01","2011-09-01","2011-10-01","2011-11-01","2011-12-01","2012-01-01"]
["Residential MCF Consumption",{"$error":"#N/A"},{"$error":"#N/A"},{"$error":"#N/A"},{"$error":"#N/A"},{"$error":"#N/A"},{"$error":"#N/A"},{"$error":"#N/A"},{"$error":"#N/A"},{"$error":"#N/A"},{"$error":"#N/A"},{"$error":"#N/A"},{"$error":"#N/A"},{"$error":"#N/A"},{"$error":"#N/A"},{"$error":"#N/A"},{"$error":"#N/A"},{"$error":"#N/A"},{"$error":"#N/A"},97974,95247,55499,17487,10603.77,9307,9298,12199,9481,21037,59559,119479,109810,64733,37811,18961,11447,8803,7924,8204,10455,27319,45490,69821,70714]
["Commercial MCF Consumption",{"$error":"#N/A"},{"$error":"#N/A"},{"$error":"#N/A"},{"$error":"#N/A"},{"$error":"#N/A"},{"$error":"#N/A"},{"$error":"#N/A"},{"$error":"#N/A"},{"$error":"#N/A"},{"$error":"#N/A"},{"$error":"#N/A"},{"$error":"#N/A"},{"$error":"#N/A"},{"$error":"#N/A"},{"$error":"#N/A"},{"$error":"#N/A"},{"$error":"#N/A"},{"$error":"#N/A"},66344,53848,38066,16809,12158.89,10960,10949,12567,11484,14254,29293,66372,68804,44278,28119,18693,14133,12244,12309,11617,13264,17226,27107,41851,43339]
["Industrial MCF Consumption",{"$error":"#N/A"},{"$error":"#N/A"},{"$error":"#N/A"},{"$error":"#N/A"},{"$error":"#N/A"},{"$error":"#N/A"},{"$error":"#N/A"},{"$error":"#N/A"},{"$error":"#N/A"},{"$error":"#N/A"},{"$error":"#N/A"},{"$error":"#N/A"},{"$error":"#N/A"},{"$error":"#N/A"},{"$error":"#N/A"},{"$error":"#N/A"},{"$error":"#N/A"},{"$error":"#N/A"},236458,226374,237192,202995,218307.09,229372,183606,208541,187975,210366,205112,211267,235597,236155,238417,224454,221289,220593,185418,223930,202220,224060,212535,203568,249317]
["Number of Service Outages",{"$error":"#N/A"},{"$error":"#N/A"},{"$error":"#N/A"},{"$error":"#N/A"},{"$error":"#N/A"},{"$error":"#N/A"},{"$error":"#N/A"},{"$error":"#N/A"},{"$error":"#N/A"},{"$error":"#N/A"},{"$error":"#N/A"},{"$error":"#N/A"},{"$error":"#N/A"},{"$error":"#N/A"},{"$error":"#N/A"},{"$error":"#N/A"},{"$error":"#N/A"},{"$error":"#N/A"},0,0,0,1,0,0,0,0,0,0,0,0,0,0,0,0,0,0,0,0,0,0,0,0,0]
["Price per Therm",{"$error":"#N/A"},{"$error":"#N/A"},{"$error":"#N/A"},{"$error":"#N/A"},{"$error":"#N/A"},{"$error":"#N/A"},{"$error":"#N/A"},{"$error":"#N/A"},{"$error":"#N/A"},{"$error":"#N/A"},{"$error":"#N/A"},{"$error":"#N/A"},{"$error":"#N/A"},{"$error":"#N/A"},{"$error":"#N/A"},{"$error":"#N/A"},{"$error":"#N/A"},{"$error":"#N/A"},{"$error":"#N/A"},{"$error":"#N/A"},{"$error":"#N/A"},{"$error":"#N/A"},{"$error":"#N/A"},{"$error":"#N/A"},{"$error":"#N/A"},{"$error":"#N/A"},{"$error":"#N/A"},{"$error":"#N/A"},{"$error":"#N/A"},{"$error":"#N/A"},{"$error":"#N/A"},{"$error":"#N/A"},{"$error":"#N/A"},{"$error":"#N/A"},{"$error":"#N/A"},{"$error":"#N/A"},1.65,1.65,1.57,1.28,1.1200000000000001,1.06,1.03]
["Lowest AGL Marketer Price per Therm",{"$error":"#N/A"},{"$error":"#N/A"},{"$error":"#N/A"},{"$error":"#N/A"},{"$error":"#N/A"},{"$error":"#N/A"},{"$error":"#N/A"},{"$error":"#N/A"},{"$error":"#N/A"},{"$error":"#N/A"},{"$error":"#N/A"},{"$error":"#N/A"},{"$error":"#N/A"},{"$error":"#N/A"},{"$error":"#N/A"},{"$error":"#N/A"},{"$error":"#N/A"},{"$error":"#N/A"},{"$error":"#N/A"},{"$error":"#N/A"},{"$error":"#N/A"},{"$error":"#N/A"},{"$error":"#N/A"},{"$error":"#N/A"},{"$error":"#N/A"},{"$error":"#N/A"},{"$error":"#N/A"},{"$error":"#N/A"},{"$error":"#N/A"},{"$error":"#N/A"},{"$error":"#N/A"},{"$error":"#N/A"},{"$error":"#N/A"},{"$error":"#N/A"},{"$error":"#N/A"},{"$error":"#N/A"},2.4700000000000002,2.4900000000000002,2.37,1.56,1.27,1.1599999999999999,1.1599999999999999]
["Utility Locates Performed",{"$error":"#N/A"},{"$error":"#N/A"},{"$error":"#N/A"},{"$error":"#N/A"},{"$error":"#N/A"},{"$error":"#N/A"},{"$error":"#N/A"},{"$error":"#N/A"},{"$error":"#N/A"},{"$error":"#N/A"},{"$error":"#N/A"},{"$error":"#N/A"},{"$error":"#N/A"},{"$error":"#N/A"},{"$error":"#N/A"},{"$error":"#N/A"},{"$error":"#N/A"},{"$error":"#N/A"},{"$error":"#N/A"},{"$error":"#N/A"},{"$error":"#N/A"},{"$error":"#N/A"},{"$error":"#N/A"},{"$error":"#N/A"},{"$error":"#N/A"},{"$error":"#N/A"},{"$error":"#N/A"},{"$error":"#N/A"},{"$error":"#N/A"},{"$error":"#N/A"},{"$error":"#N/A"},{"$error":"#N/A"},{"$error":"#N/A"},{"$error":"#N/A"},{"$error":"#N/A"},{"$error":"#N/A"},1522,1682,1571,1536,1240,1372,1270]
["Linear Miles of Right of Way Mowed",{"$error":"#N/A"},{"$error":"#N/A"},{"$error":"#N/A"},{"$error":"#N/A"},{"$error":"#N/A"},{"$error":"#N/A"},{"$error":"#N/A"},{"$error":"#N/A"},{"$error":"#N/A"},{"$error":"#N/A"},{"$error":"#N/A"},{"$error":"#N/A"},{"$error":"#N/A"},{"$error":"#N/A"},{"$error":"#N/A"},{"$error":"#N/A"},{"$error":"#N/A"},{"$error":"#N/A"},{"$error":"#N/A"},{"$error":"#N/A"},{"$error":"#N/A"},{"$error":"#N/A"},{"$error":"#N/A"},{"$error":"#N/A"},{"$error":"#N/A"},{"$error":"#N/A"},{"$error":"#N/A"},{"$error":"#N/A"},{"$error":"#N/A"},{"$error":"#N/A"},{"$error":"#N/A"},{"$error":"#N/A"},{"$error":"#N/A"},{"$error":"#N/A"},{"$error":"#N/A"},{"$error":"#N/A"},0,0,32.159999999999997,0,0,0,0]
["Service Lines Surveyed",{"$error":"#N/A"},{"$error":"#N/A"},{"$error":"#N/A"},{"$error":"#N/A"},{"$error":"#N/A"},{"$error":"#N/A"},{"$error":"#N/A"},{"$error":"#N/A"},{"$error":"#N/A"},{"$error":"#N/A"},{"$error":"#N/A"},{"$error":"#N/A"},{"$error":"#N/A"},{"$error":"#N/A"},{"$error":"#N/A"},{"$error":"#N/A"},{"$error":"#N/A"},{"$error":"#N/A"},{"$error":"#N/A"},{"$error":"#N/A"},{"$error":"#N/A"},{"$error":"#N/A"},{"$error":"#N/A"},{"$error":"#N/A"},{"$error":"#N/A"},{"$error":"#N/A"},{"$error":"#N/A"},{"$error":"#N/A"},{"$error":"#N/A"},{"$error":"#N/A"},{"$error":"#N/A"},{"$error":"#N/A"},{"$error":"#N/A"},{"$error":"#N/A"},{"$error":"#N/A"},{"$error":"#N/A"},307,837,353,159,0,0,192]
["Linear Miles of Main Surveyed",{"$error":"#N/A"},{"$error":"#N/A"},{"$error":"#N/A"},{"$error":"#N/A"},{"$error":"#N/A"},{"$error":"#N/A"},{"$error":"#N/A"},{"$error":"#N/A"},{"$error":"#N/A"},{"$error":"#N/A"},{"$error":"#N/A"},{"$error":"#N/A"},{"$error":"#N/A"},{"$error":"#N/A"},{"$error":"#N/A"},{"$error":"#N/A"},{"$error":"#N/A"},{"$error":"#N/A"},{"$error":"#N/A"},{"$error":"#N/A"},{"$error":"#N/A"},{"$error":"#N/A"},{"$error":"#N/A"},{"$error":"#N/A"},{"$error":"#N/A"},{"$error":"#N/A"},{"$error":"#N/A"},{"$error":"#N/A"},{"$error":"#N/A"},{"$error":"#N/A"},{"$error":"#N/A"},{"$error":"#N/A"},{"$error":"#N/A"},{"$error":"#N/A"},{"$error":"#N/A"},{"$error":"#N/A"},14.9,32.200000000000003,17.68,9,0,0,5.44]
[]
[]
[]
[]
[]
[]
[]
[]
[]
[]
[]
[]
["HIGHLIGHTS","2008-07-01","2008-08-01","2008-09-01","2008-10-01","2008-11-01","2008-12-01","2009-01-01","2009-02-01","2009-03-01","2009-04-01","2009-05-01","2009-06-01","2009-07-01","2009-08-01","2009-09-01","2009-10-01","2009-11-01","2009-12-01","2010-01-01","2010-02-01","2010-03-01","2010-04-01","2010-05-01","2010-06-01","2010-07-01","2010-08-01","2010-09-01","2010-10-01","2010-11-01","2010-12-01","2011-01-01","2011-02-01","2011-03-01","2011-04-01","2011-05-01","2011-06-01","2011-07-01","2011-08-01","2011-09-01","2011-10-01","2011-11-01","2011-12-01","2012-01-01"]
["Highlight 1",null,null,null,null,null,null,null,null,null,null,null,null,null,null,null,null,null,null,null,null,null,null,null,null,null,null,null,null,null,null,null,null,null,null,null,null,null,null,"1.  Completed gas line improvements associated with the West Avenue Storm Drainage Improvement Project.","Completed gas main relocation on Sugar Valley rd.","Completed gas main relocation for the Public Safety Headquarters."]
["Highlight 2",null,null,null,null,null,null,null,null,null,null,null,null,null,null,null,null,null,null,null,null,null,null,null,null,null,null,null,null,null,null,null,null,null,null,null,null,null,null,"2.  Ongoing project improving gas infrastructure on Highway 61 and Old Alabama Road Extension.","Completed system improvements on Nelson St.","Running new service to Georgia Highlands student facility."]
["Highlight 3",null,null,null,null,null,null,null,null,null,null,null,null,null,null,null,null,null,null,null,null,null,null,null,null,null,null,null,null,null,null,null,null,null,null,null,null,null,null,"3.  Repaired erosion on gas main right-of-way by the Etowah River.","Began relocation of gas mains for the Public Safety center."]
["Highlight 4",null,null,null,null,null,null,null,null,null,null,null,null,null,null,null,null,null,null,null,null,null,null,null,null,null,null,null,null,null,null,null,null,null,null,null,null,null,null,"4.  Continue to offer competitive rates to our customers, with rates substantially lower than those of the Atlanta Gas Light marketers.","Continue Old Alabama/Hwy 61 gas main installation."]
["Highlight 5"]
["Highlight 6"]
["Highlight 7"]
["Highlight 8"]
["Highlights Concaetenation",{"$f":"B28&CHAR(10)&CHAR(10)&B29&CHAR(10)&CHAR(10)&B30&CHAR(10)&CHAR(10)&B31&CHAR(10)&CHAR(10)&B32&CHAR(10)&CHAR(10)&B33&CHAR(10)&CHAR(10)&B34&CHAR(10)&CHAR(10)&B35","v":"\n\n\n\n\n\n\n\n\n\n\n\n\n\n"},"\n\n\n\n\n\n\n\n\n\n\n\n\n\n","\n\n\n\n\n\n\n\n\n\n\n\n\n\n","\n\n\n\n\n\n\n\n\n\n\n\n\n\n","\n\n\n\n\n\n\n\n\n\n\n\n\n\n","\n\n\n\n\n\n\n\n\n\n\n\n\n\n","\n\n\n\n\n\n\n\n\n\n\n\n\n\n","\n\n\n\n\n\n\n\n\n\n\n\n\n\n","\n\n\n\n\n\n\n\n\n\n\n\n\n\n","\n\n\n\n\n\n\n\n\n\n\n\n\n\n","\n\n\n\n\n\n\n\n\n\n\n\n\n\n","\n\n\n\n\n\n\n\n\n\n\n\n\n\n","\n\n\n\n\n\n\n\n\n\n\n\n\n\n","\n\n\n\n\n\n\n\n\n\n\n\n\n\n","\n\n\n\n\n\n\n\n\n\n\n\n\n\n","\n\n\n\n\n\n\n\n\n\n\n\n\n\n","\n\n\n\n\n\n\n\n\n\n\n\n\n\n","\n\n\n\n\n\n\n\n\n\n\n\n\n\n","\n\n\n\n\n\n\n\n\n\n\n\n\n\n","\n\n\n\n\n\n\n\n\n\n\n\n\n\n","\n\n\n\n\n\n\n\n\n\n\n\n\n\n","\n\n\n\n\n\n\n\n\n\n\n\n\n\n","\n\n\n\n\n\n\n\n\n\n\n\n\n\n","\n\n\n\n\n\n\n\n\n\n\n\n\n\n","\n\n\n\n\n\n\n\n\n\n\n\n\n\n","\n\n\n\n\n\n\n\n\n\n\n\n\n\n","\n\n\n\n\n\n\n\n\n\n\n\n\n\n","\n\n\n\n\n\n\n\n\n\n\n\n\n\n","\n\n\n\n\n\n\n\n\n\n\n\n\n\n","\n\n\n\n\n\n\n\n\n\n\n\n\n\n","\n\n\n\n\n\n\n\n\n\n\n\n\n\n","\n\n\n\n\n\n\n\n\n\n\n\n\n\n","\n\n\n\n\n\n\n\n\n\n\n\n\n\n","\n\n\n\n\n\n\n\n\n\n\n\n\n\n","\n\n\n\n\n\n\n\n\n\n\n\n\n\n","\n\n\n\n\n\n\n\n\n\n\n\n\n\n","\n\n\n\n\n\n\n\n\n\n\n\n\n\n","\n\n\n\n\n\n\n\n\n\n\n\n\n\n","1.  Completed gas line improvements associated with the West Avenue Storm Drainage Improvement Project.\n\n2.  Ongoing project improving gas infrastructure on Highway 61 and Old Alabama Road Extension.\n\n3.  Repaired erosion on gas main right-of-way by the Etowah River.\n\n4.  Continue to offer competitive rates to our customers, with rates substantially lower than those of the Atlanta Gas Light marketers.\n\n\n\n\n\n\n\n","Completed gas main relocation on Sugar Valley rd.\n\nCompleted system improvements on Nelson St.\n\nBegan relocation of gas mains for the Public Safety center.\n\nContinue Old Alabama/Hwy 61 gas main installation.\n\n\n\n\n\n\n\n","Completed gas main relocation for the Public Safety Headquarters.\n\nRunning new service to Georgia Highlands student facility.\n\n\n\n\n\n\n\n\n\n\n\n","\n\n\n\n\n\n\n\n\n\n\n\n\n\n",{"$f":"AR28&CHAR(10)&CHAR(10)&AR29&CHAR(10)&CHAR(10)&AR30&CHAR(10)&CHAR(10)&AR31&CHAR(10)&CHAR(10)&AR32&CHAR(10)&CHAR(10)&AR33&CHAR(10)&CHAR(10)&AR34&CHAR(10)&CHAR(10)&AR35","v":"\n\n\n\n\n\n\n\n\n\n\n\n\n\n"}]
[]
[]
[]
["Bullet Chart Source","Target","What's Better?","Band 1","Band 2","YTD Type","Max Scale","Actual 1","Actual","Actual 3","Projection 1","Projection 2","Projection 3","First Zone 1","First Zone 2","First Zone 3","Second Zone 1","Second Zone 2","Second Zone 3","Previous X 1","Previous X 2","Previous Y 1","Previous Y 2"]
[{"$f":"A5","v":"Residential MCF Consumption"},517170,"More",0.85,1,"Sum",{"$f":"ROUNDUP((ROUNDUP(MAX(B41,SUM(I41,L41)),-LEN(EVEN(MAX(B41,SUM(I41,L41))))+2)/5),-LEN(EVEN(ROUNDUP(MAX(B41,SUM(I41,L41)),-LEN(EVEN(MAX(B41,SUM(I41,L41))))+2)/5))+1)*5","v":1000000},0,{"$f":"IF(F41=\"Sum\",SUM(OFFSET(A5,0,YTDBeg,1,YTDWidth)),AVERAGE(OFFSET(A5,0,YTDBeg,1,YTDWidth)))","v":239927},0,0,{"$f":"IF(F41=\"Sum\",Projection*(I41/YTDWidth*12-I41),0)","v":0},0,{"$f":"B41*D41","v":439594.5},{"$f":"((I41+L41<=N41)*(N41-(I41+L41)))","v":199667.5},{"$f":"N41","v":439594.5},{"$f":"(E41-D41)*B41","v":77575.500000000015},{"$f":"((I41+L41<=N41+Q41)*((N41+Q41)-(I41+L41+O41)))","v":77575.5},{"$f":"Q41","v":77575.500000000015},{"$f":"IF(F41=\"Sum\",SUM(OFFSET(A5,0,YTDBeg-12,1,YTDWidth)),AVERAGE(OFFSET(A5,0,YTDBeg-12,1,YTDWidth)))","v":340863},{"$f":"T41","v":340863},1,2]
[{"$f":"A6","v":"Commercial MCF Consumption"},343104,"More",0.85,1,"Sum",{"$f":"ROUNDUP((ROUNDUP(MAX(B42,SUM(I42,L42)),-LEN(EVEN(MAX(B42,SUM(I42,L42))))+2)/5),-LEN(EVEN(ROUNDUP(MAX(B42,SUM(I42,L42)),-LEN(EVEN(MAX(B42,SUM(I42,L42))))+2)/5))+1)*5","v":350000},0,166713,0,0,0,0,291638.39999999997,{"$f":"((I42+L42<=N42)*(N42-(I42+L42)))","v":124925.39999999997},{"$f":"N42","v":291638.39999999997},51465.600000000006,{"$f":"((I42+L42<=N42+Q42)*((N42+Q42)-(I42+L42+O42)))","v":51465.600000000035},{"$f":"Q42","v":51465.600000000006},213723,{"$f":"T42","v":213723},1,2]
["Industrial MCF Consumption",2557565,"More",0.85,1,"Sum",3000000,0,1501048,0,0,0,0,2173930.25,672882.25,2173930.25,383634.75000000006,383634.75,383634.75000000006,1442464,1442464,1,2]
["Number of Service Outages",1,"Less",1,1.1499999999999999,"Sum",5,0,0,0,0,0,0,1,1,1,0.14999999999999991,0.14999999999999991,0.14999999999999991,0,0,1,2]
["Price per Therm",1.25,"Less",1,1.1499999999999999,"Average",5,0,1.337142857142857,0,0,0,0,1.25,0,1.25,0.18749999999999989,0.10035714285714303,0.18749999999999989,{"$error":"#N/A"},{"$error":"#N/A"},1,2]
["Lowest AGL Marketer Price per Therm",1.42,"More",0.85,1,"Average",5,0,1.7828571428571429,0,0,0,0,1.2069999999999999,0,1.2069999999999999,0.21300000000000002,0,0.21300000000000002,{"$error":"#N/A"},{"$error":"#N/A"},1,2]
["Utility Locates Performed",14173,"Middle",0.93,1.07,"Sum",15000,0,10193,0,0,0,0,13180.890000000001,2987.8900000000012,13180.890000000001,1984.2200000000003,1984.2199999999993,1984.2200000000003,{"$error":"#N/A"},{"$error":"#N/A"},1,2]
["Linear Miles of Right of Way Mowed",29,"Middle",0.93,1.07,"Sum",35,0,32.159999999999997,0,0,0,0,26.970000000000002,0,26.970000000000002,4.0600000000000005,0,4.0600000000000005,{"$error":"#N/A"},{"$error":"#N/A"},1,2]
["Service Lines Surveyed",4028,"Middle",0.93,1.07,"Sum",4500,0,1848,0,0,0,0,3746.0400000000004,1898.0400000000004,3746.0400000000004,563.92000000000007,563.92000000000053,563.92000000000007,{"$error":"#N/A"},{"$error":"#N/A"},1,2]
["Linear Miles of Main Surveyed",156,"Middle",0.93,1.07,"Sum",200,0,79.22,0,0,0,0,145.08000000000001,65.860000000000014,145.08000000000001,21.840000000000003,21.840000000000003,21.840000000000003,{"$error":"#N/A"},{"$error":"#N/A"},1,2]
[]
[]
[]
[]
[]
[]
[]
[]
[]
[]
[]
[]
[]
[]
["SPARKLINE SOURCE"]
[null,11,10,9,8,7,6,5,4,3,2,1,0]
["Measure",{"$f":"OFFSET($A4,0,CurrentMonthCount-B$66,1,1)","v":"2011-02-01"},"2011-03-01","2011-04-01","2011-05-01","2011-06-01","2011-07-01","2011-08-01","2011-09-01","2011-10-01","2011-11-01","2011-12-01","2012-01-01"]
[{"$f":"A5","v":"Residential MCF Consumption"},{"$f":"OFFSET($A5,0,CurrentMonthCount-B$66,1,1)","v":64733},37811,18961,11447,8803,7924,8204,10455,27319,45490,69821,70714]
[{"$f":"A6","v":"Commercial MCF Consumption"},{"$f":"OFFSET($A6,0,CurrentMonthCount-B$66,1,1)","v":44278},28119,18693,14133,12244,12309,11617,13264,17226,27107,41851,43339]
["Industrial MCF Consumption",{"$f":"OFFSET($A7,0,CurrentMonthCount-B$66,1,1)","v":236155},238417,224454,221289,220593,185418,223930,202220,224060,212535,203568,249317]
["Number of Service Outages",{"$f":"OFFSET($A8,0,CurrentMonthCount-B$66,1,1)","v":0},0,0,0,0,0,0,0,0,0,0,0]
["Price per Therm",{"$f":"OFFSET($A9,0,CurrentMonthCount-B$66,1,1)","v":{"$error":"#N/A"}},{"$error":"#N/A"},{"$error":"#N/A"},{"$error":"#N/A"},{"$error":"#N/A"},1.65,1.65,1.57,1.28,1.1200000000000001,1.06,1.03]
["Lowest AGL Marketer Price per Therm",{"$f":"OFFSET($A10,0,CurrentMonthCount-B$66,1,1)","v":{"$error":"#N/A"}},{"$error":"#N/A"},{"$error":"#N/A"},{"$error":"#N/A"},{"$error":"#N/A"},2.4700000000000002,2.4900000000000002,2.37,1.56,1.27,1.1599999999999999,1.1599999999999999]
["Utility Locates Performed",{"$f":"OFFSET($A11,0,CurrentMonthCount-B$66,1,1)","v":{"$error":"#N/A"}},{"$error":"#N/A"},{"$error":"#N/A"},{"$error":"#N/A"},{"$error":"#N/A"},1522,1682,1571,1536,1240,1372,1270]
["Linear Miles of Right of Way Mowed",{"$f":"OFFSET($A12,0,CurrentMonthCount-B$66,1,1)","v":{"$error":"#N/A"}},{"$error":"#N/A"},{"$error":"#N/A"},{"$error":"#N/A"},{"$error":"#N/A"},0,0,32.159999999999997,0,0,0,0]
["Service Lines Surveyed",{"$f":"OFFSET($A13,0,CurrentMonthCount-B$66,1,1)","v":{"$error":"#N/A"}},{"$error":"#N/A"},{"$error":"#N/A"},{"$error":"#N/A"},{"$error":"#N/A"},307,837,353,159,0,0,192]
["Linear Miles of Main Surveyed",{"$f":"OFFSET($A14,0,CurrentMonthCount-B$66,1,1)","v":{"$error":"#N/A"}},{"$error":"#N/A"},{"$error":"#N/A"},{"$error":"#N/A"},{"$error":"#N/A"},14.9,32.200000000000003,17.68,9,0,0,5.44]
[0,{"$f":"OFFSET($A15,0,CurrentMonthCount-B$66,1,1)","v":0},0,0,0,0,0,0,0,0,0,0,0]
[0,{"$f":"OFFSET($A16,0,CurrentMonthCount-B$66,1,1)","v":0},0,0,0,0,0,0,0,0,0,0,0]
[0,{"$f":"OFFSET($A17,0,CurrentMonthCount-B$66,1,1)","v":0},0,0,0,0,0,0,0,0,0,0,0]
[0,{"$f":"OFFSET($A18,0,CurrentMonthCount-B$66,1,1)","v":0},0,0,0,0,0,0,0,0,0,0,0]
[0,{"$f":"OFFSET($A19,0,CurrentMonthCount-B$66,1,1)","v":0},0,0,0,0,0,0,0,0,0,0,0]
[0,{"$f":"OFFSET($A20,0,CurrentMonthCount-B$66,1,1)","v":0},0,0,0,0,0,0,0,0,0,0,0]
[0,{"$f":"OFFSET($A21,0,CurrentMonthCount-B$66,1,1)","v":0},0,0,0,0,0,0,0,0,0,0,0]
[0,{"$f":"OFFSET($A22,0,CurrentMonthCount-B$66,1,1)","v":0},0,0,0,0,0,0,0,0,0,0,0]
[0,{"$f":"OFFSET($A23,0,CurrentMonthCount-B$66,1,1)","v":0},0,0,0,0,0,0,0,0,0,0,0]
[0,{"$f":"OFFSET($A24,0,CurrentMonthCount-B$66,1,1)","v":0},0,0,0,0,0,0,0,0,0,0,0]

{"sheet":"Water","index":23,"n_rows":10,"n_cols":9,"rows_kept":10,"cut":false,"hidden":false,"merged":[]}
[{"$f":"CurrentMonth","v":"2012-01-01"},null,null,null,"WATER & SEWER"]
[]
["Service","Last 12 Months","Fiscal Year to Date","FYTD",null,"System","Last 12 Months","Fiscal Year to Date","FYTD"]
[{"$f":"'Water Data'!A5","v":"Residential Water Consumption"},null,null,{"$f":"'Water Data'!I41","v":392802},null,{"$f":"'Water Data'!A8","v":"Sanitary Sewer Overflows"},null,null,{"$f":"'Water Data'!I44","v":0}]
[{"$f":"'Water Data'!A6","v":"Commercial Water Consumption"},null,null,{"$f":"'Water Data'!I42","v":229030},null,{"$f":"'Water Data'!A9","v":"Permit Violation - Water Treatment"},null,null,{"$f":"'Water Data'!I45","v":0}]
[{"$f":"'Water Data'!A7","v":"Industrial Water Consumption"},null,null,{"$f":"'Water Data'!I43","v":2167154},null,{"$f":"'Water Data'!A10","v":"Permit Violation - Wastewater Treatment"},null,null,{"$f":"'Water Data'!I46","v":0}]
[null,null,null,null,null,{"$f":"'Water Data'!A11","v":"Water Samples Out of Compliance"},null,null,{"$f":"'Water Data'!I47","v":2}]
["Cost",null,null,null,null,{"$f":"'Water Data'!A12","v":"Water Compliance Fines"},null,null,{"$f":"'Water Data'!I48","v":0}]
[{"$f":"'Water Data'!A14","v":"Average Cost for 7,500 Gallons/Competitor Average"},null,null,{"$f":"'Water Data'!I50","v":0.72817018984785242},null,{"$f":"'Water Data'!A13","v":"Service Outages"},null,null,{"$f":"'Water Data'!I49","v":0}]
[null,null,null,null,null,{"$f":"'Water Data'!A15","v":"Distribution System Water Loss (Rolling Average)"},null,null,{"$f":"'Water Data'!I51","v":0.1046857142857143}]

{"sheet":"Water Data","index":24,"n_rows":87,"n_cols":44,"rows_kept":87,"cut":false,"hidden":true,"merged":[]}
["Water Data"]
[]
[]
["Measure","2008-07-01","2008-08-01","2008-09-01","2008-10-01","2008-11-01","2008-12-01","2009-01-01","2009-02-01","2009-03-01","2009-04-01","2009-05-01","2009-06-01","2009-07-01","2009-08-01","2009-09-01","2009-10-01","2009-11-01","2009-12-01","2010-01-01","2010-02-01","2010-03-01","2010-04-01","2010-05-01","2010-06-01","2010-07-01","2010-08-01","2010-09-01","2010-10-01","2010-11-01","2010-12-01","2011-01-01","2011-02-01","2011-03-01","2011-04-01","2011-05-01","2011-06-01","2011-07-01","2011-08-01","2011-09-01","2011-10-01","2011-11-01","2011-12-01","2012-01-01"]
["Residential Water Consumption",{"$error":"#N/A"},{"$error":"#N/A"},{"$error":"#N/A"},{"$error":"#N/A"},{"$error":"#N/A"},{"$error":"#N/A"},{"$error":"#N/A"},{"$error":"#N/A"},{"$error":"#N/A"},{"$error":"#N/A"},{"$error":"#N/A"},{"$error":"#N/A"},{"$error":"#N/A"},{"$error":"#N/A"},{"$error":"#N/A"},{"$error":"#N/A"},{"$error":"#N/A"},{"$error":"#N/A"},48105,43821,44751,50858,51515,63906,61413,60441,64879,56633,47621,48948,48296,49148,43738,47898,55025,68885,71644,65775,64117,51985,45035,46130,48116]
["Commercial Water Consumption",{"$error":"#N/A"},{"$error":"#N/A"},{"$error":"#N/A"},{"$error":"#N/A"},{"$error":"#N/A"},{"$error":"#N/A"},{"$error":"#N/A"},{"$error":"#N/A"},{"$error":"#N/A"},{"$error":"#N/A"},{"$error":"#N/A"},{"$error":"#N/A"},{"$error":"#N/A"},{"$error":"#N/A"},{"$error":"#N/A"},{"$error":"#N/A"},{"$error":"#N/A"},{"$error":"#N/A"},28373,31411,29243,30645,30505,31274,35260,36804,39570,35639,32072,31966,29923,31999,28565,29808,33575,34167,35615,37130,38948,33663,29457,26842,27375]
["Industrial Water Consumption",{"$error":"#N/A"},{"$error":"#N/A"},{"$error":"#N/A"},{"$error":"#N/A"},{"$error":"#N/A"},{"$error":"#N/A"},{"$error":"#N/A"},{"$error":"#N/A"},{"$error":"#N/A"},{"$error":"#N/A"},{"$error":"#N/A"},{"$error":"#N/A"},{"$error":"#N/A"},{"$error":"#N/A"},{"$error":"#N/A"},{"$error":"#N/A"},{"$error":"#N/A"},{"$error":"#N/A"},287823,316156,277145,311522,295432,304372,347595,341590,352443,321045,285111,280627,277455,279163,249485,277091,264090,321549,327116,303249,361300,381666,278211,262770,252842]
["Sanitary Sewer Overflows",{"$error":"#N/A"},{"$error":"#N/A"},{"$error":"#N/A"},{"$error":"#N/A"},{"$error":"#N/A"},{"$error":"#N/A"},{"$error":"#N/A"},{"$error":"#N/A"},{"$error":"#N/A"},{"$error":"#N/A"},{"$error":"#N/A"},{"$error":"#N/A"},{"$error":"#N/A"},{"$error":"#N/A"},{"$error":"#N/A"},{"$error":"#N/A"},{"$error":"#N/A"},{"$error":"#N/A"},{"$error":"#N/A"},{"$error":"#N/A"},{"$error":"#N/A"},{"$error":"#N/A"},{"$error":"#N/A"},{"$error":"#N/A"},{"$error":"#N/A"},{"$error":"#N/A"},{"$error":"#N/A"},{"$error":"#N/A"},{"$error":"#N/A"},{"$error":"#N/A"},{"$error":"#N/A"},{"$error":"#N/A"},{"$error":"#N/A"},{"$error":"#N/A"},{"$error":"#N/A"},{"$error":"#N/A"},0,0,0,0,0,0,0]
["Permit Violation - Water Treatment",{"$error":"#N/A"},{"$error":"#N/A"},{"$error":"#N/A"},{"$error":"#N/A"},{"$error":"#N/A"},{"$error":"#N/A"},{"$error":"#N/A"},{"$error":"#N/A"},{"$error":"#N/A"},{"$error":"#N/A"},{"$error":"#N/A"},{"$error":"#N/A"},{"$error":"#N/A"},{"$error":"#N/A"},{"$error":"#N/A"},{"$error":"#N/A"},{"$error":"#N/A"},{"$error":"#N/A"},{"$error":"#N/A"},{"$error":"#N/A"},{"$error":"#N/A"},{"$error":"#N/A"},{"$error":"#N/A"},{"$error":"#N/A"},{"$error":"#N/A"},{"$error":"#N/A"},{"$error":"#N/A"},{"$error":"#N/A"},{"$error":"#N/A"},{"$error":"#N/A"},{"$error":"#N/A"},{"$error":"#N/A"},{"$error":"#N/A"},{"$error":"#N/A"},{"$error":"#N/A"},{"$error":"#N/A"},0,0,0,0,0,0,0]
["Permit Violation - Wastewater Treatment",{"$error":"#N/A"},{"$error":"#N/A"},{"$error":"#N/A"},{"$error":"#N/A"},{"$error":"#N/A"},{"$error":"#N/A"},{"$error":"#N/A"},{"$error":"#N/A"},{"$error":"#N/A"},{"$error":"#N/A"},{"$error":"#N/A"},{"$error":"#N/A"},{"$error":"#N/A"},{"$error":"#N/A"},{"$error":"#N/A"},{"$error":"#N/A"},{"$error":"#N/A"},{"$error":"#N/A"},{"$error":"#N/A"},{"$error":"#N/A"},{"$error":"#N/A"},{"$error":"#N/A"},{"$error":"#N/A"},{"$error":"#N/A"},{"$error":"#N/A"},{"$error":"#N/A"},{"$error":"#N/A"},{"$error":"#N/A"},{"$error":"#N/A"},{"$error":"#N/A"},{"$error":"#N/A"},{"$error":"#N/A"},{"$error":"#N/A"},{"$error":"#N/A"},{"$error":"#N/A"},{"$error":"#N/A"},0,0,0,0,0,0,0]
["Water Samples Out of Compliance",{"$error":"#N/A"},{"$error":"#N/A"},{"$error":"#N/A"},{"$error":"#N/A"},{"$error":"#N/A"},{"$error":"#N/A"},{"$error":"#N/A"},{"$error":"#N/A"},{"$error":"#N/A"},{"$error":"#N/A"},{"$error":"#N/A"},{"$error":"#N/A"},{"$error":"#N/A"},{"$error":"#N/A"},{"$error":"#N/A"},{"$error":"#N/A"},{"$error":"#N/A"},{"$error":"#N/A"},0,0,0,0,0,0,2,0,0,0,0,0,0,0,0,0,0,0,0,2,0,0,0,0,0]
["Water Compliance Fines",{"$error":"#N/A"},{"$error":"#N/A"},{"$error":"#N/A"},{"$error":"#N/A"},{"$error":"#N/A"},{"$error":"#N/A"},{"$error":"#N/A"},{"$error":"#N/A"},{"$error":"#N/A"},{"$error":"#N/A"},{"$error":"#N/A"},{"$error":"#N/A"},{"$error":"#N/A"},{"$error":"#N/A"},{"$error":"#N/A"},{"$error":"#N/A"},{"$error":"#N/A"},{"$error":"#N/A"},0,0,0,0,0,0,0,0,0,0,0,0,0,0,0,0,0,0,0,0,0,0,0,0,0]
["Service Outages",{"$error":"#N/A"},{"$error":"#N/A"},{"$error":"#N/A"},{"$error":"#N/A"},{"$error":"#N/A"},{"$error":"#N/A"},{"$error":"#N/A"},{"$error":"#N/A"},{"$error":"#N/A"},{"$error":"#N/A"},{"$error":"#N/A"},{"$error":"#N/A"},{"$error":"#N/A"},{"$error":"#N/A"},{"$error":"#N/A"},{"$error":"#N/A"},{"$error":"#N/A"},{"$error":"#N/A"},6,0,1,0,0,7,0,0,0,0,0,0,0,0,0,0,0,0,0,0,0,0,0,0,0]
["Average Cost for 7,500 Gallons/Competitor Average",{"$error":"#N/A"},{"$error":"#N/A"},{"$error":"#N/A"},{"$error":"#N/A"},{"$error":"#N/A"},{"$error":"#N/A"},{"$error":"#N/A"},{"$error":"#N/A"},{"$error":"#N/A"},{"$error":"#N/A"},{"$error":"#N/A"},{"$error":"#N/A"},{"$error":"#N/A"},{"$error":"#N/A"},{"$error":"#N/A"},{"$error":"#N/A"},{"$error":"#N/A"},{"$error":"#N/A"},{"$error":"#N/A"},{"$error":"#N/A"},{"$error":"#N/A"},{"$error":"#N/A"},{"$error":"#N/A"},{"$error":"#N/A"},{"$error":"#N/A"},{"$error":"#N/A"},{"$error":"#N/A"},{"$error":"#N/A"},{"$error":"#N/A"},{"$error":"#N/A"},{"$error":"#N/A"},{"$error":"#N/A"},{"$error":"#N/A"},{"$error":"#N/A"},{"$error":"#N/A"},{"$error":"#N/A"},0.73,0.73,0.73,0.72573044297832223,0.72573044297832223,0.72573044297832223,0.73]
["Distribution System Water Loss (Rolling Average)",{"$error":"#N/A"},{"$error":"#N/A"},{"$error":"#N/A"},{"$error":"#N/A"},{"$error":"#N/A"},{"$error":"#N/A"},{"$error":"#N/A"},{"$error":"#N/A"},{"$error":"#N/A"},{"$error":"#N/A"},{"$error":"#N/A"},{"$error":"#N/A"},{"$error":"#N/A"},{"$error":"#N/A"},{"$error":"#N/A"},{"$error":"#N/A"},{"$error":"#N/A"},{"$error":"#N/A"},8.1199999999999994E-2,8.4000000000000005E-2,8.5999999999999993E-2,8.4500000000000006E-2,8.1699999999999995E-2,7.9500000000000001E-2,7.9699999999999993E-2,8.2799999999999999E-2,8.1900000000000001E-2,7.7600000000000002E-2,7.7299999999999994E-2,8.09E-2,7.8799999999999995E-2,8.0199999999999994E-2,8.5099999999999995E-2,8.8599999999999998E-2,9.35E-2,9.9099999999999994E-2,0.1016,0.10050000000000001,0.1002,0.10440000000000001,0.1082,0.1094,0.1085]
[]
[]
[]
[]
[]
[]
[]
[]
[]
[]
[]
["HIGHLIGHTS","2008-07-01","2008-08-01","2008-09-01","2008-10-01","2008-11-01","2008-12-01","2009-01-01","2009-02-01","2009-03-01","2009-04-01","2009-05-01","2009-06-01","2009-07-01","2009-08-01","2009-09-01","2009-10-01","2009-11-01","2009-12-01","2010-01-01","2010-02-01","2010-03-01","2010-04-01","2010-05-01","2010-06-01","2010-07-01","2010-08-01","2010-09-01","2010-10-01","2010-11-01","2010-12-01","2011-01-01","2011-02-01","2011-03-01","2011-04-01","2011-05-01","2011-06-01","2011-07-01","2011-08-01","2011-09-01","2011-10-01","2011-11-01","2011-12-01","2012-01-01"]
["Highlight 1",null,null,null,null,null,null,null,null,null,null,null,null,null,null,null,null,null,null,null,null,null,null,null,null,null,null,null,null,null,null,null,null,null,null,null,null,null,null,"Completed the sewer extension project on East MLK Blvd., installing 125 feet of 8 inch diameter sewer line.",null,null,"Completion of Indian Mounds Road Water Main Phase I - 3500' 8\" DIP","Begin S. Erwin St. Water main replacement"]
["Highlight 2",null,null,null,null,null,null,null,null,null,null,null,null,null,null,null,null,null,null,null,null,null,null,null,null,null,null,null,null,null,null,null,null,null,null,null,null,null,null,"Completed a water main relocation project on West Avenue, relocating 60 feet of 12 inch diameter water line.",null,null,"Pre-Construction meeting for S. Erwin St 12\" Main Replacement held. Notice to proceed date set of 1/9/12","Begin Phase II of Indian Mounds Road water main replacement (through Bow&Arrow Mobile Home Park)"]
["Highlight 3",null,null,null,null,null,null,null,null,null,null,null,null,null,null,null,null,null,null,null,null,null,null,null,null,null,null,null,null,null,null,null,null,null,null,null,null,null,null,null,null,null,null,"Found/repaired significant main leak behind Market Square shopping center"]
["Highlight 4"]
["Highlight 5"]
["Highlight 6"]
["Highlight 7"]
["Highlight 8"]
["Highlights Concaetenation",{"$f":"B28&CHAR(10)&B29&CHAR(10)&B30&CHAR(10)&B31&CHAR(10)&B32&CHAR(10)&B33&CHAR(10)&B34&CHAR(10)&B35","v":"\n\n\n\n\n\n\n"},{"$f":"C28&CHAR(10)&C29&CHAR(10)&C30&CHAR(10)&C31&CHAR(10)&C32&CHAR(10)&C33&CHAR(10)&C34&CHAR(10)&C35","v":"\n\n\n\n\n\n\n"},"\n\n\n\n\n\n\n","\n\n\n\n\n\n\n","\n\n\n\n\n\n\n","\n\n\n\n\n\n\n","\n\n\n\n\n\n\n","\n\n\n\n\n\n\n","\n\n\n\n\n\n\n","\n\n\n\n\n\n\n","\n\n\n\n\n\n\n","\n\n\n\n\n\n\n","\n\n\n\n\n\n\n","\n\n\n\n\n\n\n","\n\n\n\n\n\n\n","\n\n\n\n\n\n\n","\n\n\n\n\n\n\n","\n\n\n\n\n\n\n","\n\n\n\n\n\n\n","\n\n\n\n\n\n\n","\n\n\n\n\n\n\n","\n\n\n\n\n\n\n","\n\n\n\n\n\n\n","\n\n\n\n\n\n\n","\n\n\n\n\n\n\n","\n\n\n\n\n\n\n","\n\n\n\n\n\n\n","\n\n\n\n\n\n\n","\n\n\n\n\n\n\n","\n\n\n\n\n\n\n","\n\n\n\n\n\n\n","\n\n\n\n\n\n\n","\n\n\n\n\n\n\n","\n\n\n\n\n\n\n","\n\n\n\n\n\n\n",{"$f":"AK28&CHAR(10)&AK29&CHAR(10)&AK30&CHAR(10)&AK31&CHAR(10)&AK32&CHAR(10)&AK33&CHAR(10)&AK34&CHAR(10)&AK35","v":"\n\n\n\n\n\n\n"},"\n\n\n\n\n\n\n",{"$f":"AM28&CHAR(10)&CHAR(10)&AM29&CHAR(10)&CHAR(10)&AM30&CHAR(10)&CHAR(10)&AM31&CHAR(10)&CHAR(10)&AM32&CHAR(10)&CHAR(10)&AM33&CHAR(10)&CHAR(10)&AM34&CHAR(10)&CHAR(10)&AM35","v":"\n\n\n\n\n\n\n\n\n\n\n\n\n\n"},"Completed the sewer extension project on East MLK Blvd., installing 125 feet of 8 inch diameter sewer line.\n\nCompleted a water main relocation project on West Avenue, relocating 60 feet of 12 inch diameter water line.\n\n\n\n\n\n\n\n\n\n\n\n","\n\n\n\n\n\n\n\n\n\n\n\n\n\n","\n\n\n\n\n\n\n\n\n\n\n\n\n\n","Completion of Indian Mounds Road Water Main Phase I - 3500' 8\" DIP\n\nPre-Construction meeting for S. Erwin St 12\" Main Replacement held. Notice to proceed date set of 1/9/12\n\n\n\n\n\n\n\n\n\n\n\n","Begin S. Erwin St. Water main replacement\n\nBegin Phase II of Indian Mounds Road water main replacement (through Bow&Arrow Mobile Home Park)\n\nFound/repaired significant main leak behind Market Square shopping center\n\n\n\n\n\n\n\n\n\n"]
[]
[]
[]
["Bullet Chart Source","Target","What's Better?","Band 1","Band 2","YTD Type","Max Scale","Actual 1","Actual","Actual 3","Projection 1","Projection 2","Projection 3","First Zone 1","First Zone 2","First Zone 3","Second Zone 1","Second Zone 2","Second Zone 3","Previous X 1","Previous X 2","Previous Y 1","Previous Y 2"]
[{"$f":"A5","v":"Residential Water Consumption"},645000,"More",0.85,1,"Sum",{"$f":"ROUNDUP((ROUNDUP(MAX(B41,SUM(I41,L41)),-LEN(EVEN(MAX(B41,SUM(I41,L41))))+2)/5),-LEN(EVEN(ROUNDUP(MAX(B41,SUM(I41,L41)),-LEN(EVEN(MAX(B41,SUM(I41,L41))))+2)/5))+1)*5","v":1000000},0,{"$f":"IF(F41=\"Sum\",SUM(OFFSET(A5,0,YTDBeg,1,YTDWidth)),AVERAGE(OFFSET(A5,0,YTDBeg,1,YTDWidth)))","v":392802},0,0,{"$f":"IF(F41=\"Sum\",Projection*(I41/YTDWidth*12-I41),0)","v":0},0,{"$f":"B41*D41","v":548250},{"$f":"((I41+L41<=N41)*(N41-(I41+L41)))","v":155448},{"$f":"N41","v":548250},{"$f":"(E41-D41)*B41","v":96750.000000000015},{"$f":"((I41+L41<=N41+Q41)*((N41+Q41)-(I41+L41+O41)))","v":96750},{"$f":"Q41","v":96750.000000000015},{"$f":"IF(F41=\"Sum\",SUM(OFFSET(A5,0,YTDBeg-12,1,YTDWidth)),AVERAGE(OFFSET(A5,0,YTDBeg-12,1,YTDWidth)))","v":388231},{"$f":"T41","v":388231},1,2]
[{"$f":"A6","v":"Commercial Water Consumption"},390000,"More",0.85,1,"Sum",{"$f":"ROUNDUP((ROUNDUP(MAX(B42,SUM(I42,L42)),-LEN(EVEN(MAX(B42,SUM(I42,L42))))+2)/5),-LEN(EVEN(ROUNDUP(MAX(B42,SUM(I42,L42)),-LEN(EVEN(MAX(B42,SUM(I42,L42))))+2)/5))+1)*5","v":400000},0,229030,0,0,0,0,331500,{"$f":"((I42+L42<=N42)*(N42-(I42+L42)))","v":102470},{"$f":"N42","v":331500},58500.000000000007,{"$f":"((I42+L42<=N42+Q42)*((N42+Q42)-(I42+L42+O42)))","v":58500},{"$f":"Q42","v":58500.000000000007},241234,{"$f":"T42","v":241234},1,2]
["Industrial Water Consumption",3600000,"More",0.85,1,"Sum",4000000,0,2167154,0,0,0,0,3060000,892846,3060000,540000.00000000012,540000,540000.00000000012,2205866,2205866,1,2]
["Sanitary Sewer Overflows",0,"Less",1,1.1499999999999999,"Sum",0,0,0,0,0,0,0,0,0,0,0,0,0,{"$error":"#N/A"},{"$error":"#N/A"},1,2]
["Permit Violation - Water Treatment",0,"Less",1,1.1499999999999999,"Sum",0,0,0,0,0,0,0,0,0,0,0,0,0,{"$error":"#N/A"},{"$error":"#N/A"},1,2]
["Permit Violation - Wastewater Treatment",0,"Less",1,1.1499999999999999,"Sum",0,0,0,0,0,0,0,0,0,0,0,0,0,{"$error":"#N/A"},{"$error":"#N/A"},1,2]
["Water Samples Out of Compliance",0,"Less",1,1.1499999999999999,"Sum",5,0,2,0,0,0,0,0,0,0,0,0,0,2,2,1,2]
["Water Compliance Fines",0,"Less",1,1.1499999999999999,"Sum",0,0,0,0,0,0,0,0,0,0,0,0,0,0,0,1,2]
["Service Outages",50,"Less",1,1.1499999999999999,"Sum",50,0,0,0,0,0,0,50,50,50,7.4999999999999956,7.4999999999999929,7.4999999999999956,0,0,1,2]
["Average Cost for 7,500 Gallons/Competitor Average",1,"Less",1,1.1499999999999999,"Average",1,0,0.72817018984785242,0,0,0,0,1,0.27182981015214758,1,0.14999999999999991,0.14999999999999991,0.14999999999999991,{"$error":"#N/A"},{"$error":"#N/A"},1,2]
["Distribution System Water Loss (Rolling Average)",0.1,"Less",1,1.1499999999999999,"Average",1,0,0.1046857142857143,0,0,0,0,{"$f":"B51*D51","v":0.1},{"$f":"((I51+L51<=N51)*(N51-(I51+L51)))","v":0},{"$f":"N51","v":0.1},{"$f":"(E51-D51)*B51","v":1.4999999999999993E-2},{"$f":"((I51+L51<=N51+Q51)*((N51+Q51)-(I51+L51+O51)))","v":1.0314285714285693E-2},{"$f":"Q51","v":1.4999999999999993E-2},7.9857142857142849E-2,{"$f":"T51","v":7.9857142857142849E-2},1,2]
[]
[]
[]
[]
[]
[]
[]
[]
[]
[]
[]
[]
[]
["SPARKLINE SOURCE"]
[null,11,10,9,8,7,6,5,4,3,2,1,0]
["Measure",{"$f":"OFFSET($A4,0,CurrentMonthCount-B$66,1,1)","v":"2011-02-01"},"2011-03-01","2011-04-01","2011-05-01","2011-06-01","2011-07-01","2011-08-01","2011-09-01","2011-10-01","2011-11-01","2011-12-01","2012-01-01"]
[{"$f":"A5","v":"Residential Water Consumption"},{"$f":"OFFSET($A5,0,CurrentMonthCount-B$66,1,1)","v":49148},43738,47898,55025,68885,71644,65775,64117,51985,45035,46130,48116]
[{"$f":"A6","v":"Commercial Water Consumption"},{"$f":"OFFSET($A6,0,CurrentMonthCount-B$66,1,1)","v":31999},28565,29808,33575,34167,35615,37130,38948,33663,29457,26842,27375]
["Industrial Water Consumption",{"$f":"OFFSET($A7,0,CurrentMonthCount-B$66,1,1)","v":279163},249485,277091,264090,321549,327116,303249,361300,381666,278211,262770,252842]
["Sanitary Sewer Overflows",{"$f":"OFFSET($A8,0,CurrentMonthCount-B$66,1,1)","v":{"$error":"#N/A"}},{"$error":"#N/A"},{"$error":"#N/A"},{"$error":"#N/A"},{"$error":"#N/A"},0,0,0,0,0,0,0]
["Permit Violation - Water Treatment",{"$f":"OFFSET($A9,0,CurrentMonthCount-B$66,1,1)","v":{"$error":"#N/A"}},{"$error":"#N/A"},{"$error":"#N/A"},{"$error":"#N/A"},{"$error":"#N/A"},0,0,0,0,0,0,0]
["Permit Violation - Wastewater Treatment",{"$f":"OFFSET($A10,0,CurrentMonthCount-B$66,1,1)","v":{"$error":"#N/A"}},{"$error":"#N/A"},{"$error":"#N/A"},{"$error":"#N/A"},{"$error":"#N/A"},0,0,0,0,0,0,0]
["Water Samples Out of Compliance",{"$f":"OFFSET($A11,0,CurrentMonthCount-B$66,1,1)","v":0},0,0,0,0,0,2,0,0,0,0,0]
["Water Compliance Fines",{"$f":"OFFSET($A12,0,CurrentMonthCount-B$66,1,1)","v":0},0,0,0,0,0,0,0,0,0,0,0]
["Service Outages",{"$f":"OFFSET($A13,0,CurrentMonthCount-B$66,1,1)","v":0},0,0,0,0,0,0,0,0,0,0,0]
["Average Cost for 7,500 Gallons/Competitor Average",{"$f":"OFFSET($A14,0,CurrentMonthCount-B$66,1,1)","v":{"$error":"#N/A"}},{"$error":"#N/A"},{"$error":"#N/A"},{"$error":"#N/A"},{"$error":"#N/A"},0.73,0.73,0.73,0.72573044297832223,0.72573044297832223,0.72573044297832223,0.73]
["Distribution System Water Loss (Rolling Average)",{"$f":"OFFSET($A15,0,CurrentMonthCount-B$66,1,1)","v":8.0199999999999994E-2},8.5099999999999995E-2,8.8599999999999998E-2,9.35E-2,9.9099999999999994E-2,0.1016,0.10050000000000001,0.1002,0.10440000000000001,0.1082,0.1094,0.1085]
[0,{"$f":"OFFSET($A16,0,CurrentMonthCount-B$66,1,1)","v":0},0,0,0,0,0,0,0,0,0,0,0]
[0,{"$f":"OFFSET($A17,0,CurrentMonthCount-B$66,1,1)","v":0},0,0,0,0,0,0,0,0,0,0,0]
[0,{"$f":"OFFSET($A18,0,CurrentMonthCount-B$66,1,1)","v":0},0,0,0,0,0,0,0,0,0,0,0]
[0,{"$f":"OFFSET($A19,0,CurrentMonthCount-B$66,1,1)","v":0},0,0,0,0,0,0,0,0,0,0,0]
[0,{"$f":"OFFSET($A20,0,CurrentMonthCount-B$66,1,1)","v":0},0,0,0,0,0,0,0,0,0,0,0]
[0,{"$f":"OFFSET($A21,0,CurrentMonthCount-B$66,1,1)","v":0},0,0,0,0,0,0,0,0,0,0,0]
[0,{"$f":"OFFSET($A22,0,CurrentMonthCount-B$66,1,1)","v":0},0,0,0,0,0,0,0,0,0,0,0]
[0,{"$f":"OFFSET($A23,0,CurrentMonthCount-B$66,1,1)","v":0},0,0,0,0,0,0,0,0,0,0,0]
[0,{"$f":"OFFSET($A24,0,CurrentMonthCount-B$66,1,1)","v":0},0,0,0,0,0,0,0,0,0,0,0]

{"sheet":"Solid","index":25,"n_rows":10,"n_cols":9,"rows_kept":10,"cut":false,"hidden":false,"merged":[]}
[{"$f":"CurrentMonth","v":"2012-01-01"},null,null,null,"SOLID WASTE"]
[]
["Waste Collection","Last 12 Months","Fiscal Year to Date","FYTD",null,"Waste Cost","Last 12 Months","Fiscal Year to Date","FYTD"]
[{"$f":"'Solid Data'!A5","v":"Residential Solid Waste Collected per Collection Day (Tons)"},null,null,{"$f":"'Solid Data'!I41","v":23.09714285714286},null,{"$f":"'Solid Data'!A7","v":"Landfill Expense per Collection Day - Residential"},null,null,{"$f":"'Solid Data'!I43","v":646.69428571428568}]
[{"$f":"'Solid Data'!A6","v":"Commercial Solid Waste Collected per Collection Day (Tons)"},null,null,{"$f":"'Solid Data'!I42","v":17.654285714285717},null,{"$f":"'Solid Data'!A8","v":"Landfill Expense per Collection Day - Commercial"},null,null,{"$f":"'Solid Data'!I44","v":494.33714285714279}]
[]
["Operations",null,null,null,null,"Human Resources"]
[{"$f":"'Solid Data'!A9","v":"Average Number of Receptacles Collected per Route-hour"},null,null,{"$f":"'Solid Data'!I45","v":95.285714285714292},null,{"$f":"'Solid Data'!A12","v":"Staff Injuries (Solid Waste)"},null,null,{"$f":"'Solid Data'!I48","v":3}]
[{"$f":"'Solid Data'!A10","v":"Curbies Missed While Conducting Normal Pick-up"},null,null,{"$f":"'Solid Data'!I46","v":29}]
[{"$f":"'Solid Data'!A11","v":"Complaints Received"},null,null,{"$f":"'Solid Data'!I47","v":28}]

{"sheet":"Solid Data","index":26,"n_rows":87,"n_cols":44,"rows_kept":87,"cut":false,"hidden":true,"merged":[]}
["Solid Data"]
[]
[]
["Measure","2008-07-01","2008-08-01","2008-09-01","2008-10-01","2008-11-01","2008-12-01","2009-01-01","2009-02-01","2009-03-01","2009-04-01","2009-05-01","2009-06-01","2009-07-01","2009-08-01","2009-09-01","2009-10-01","2009-11-01","2009-12-01","2010-01-01","2010-02-01","2010-03-01","2010-04-01","2010-05-01","2010-06-01","2010-07-01","2010-08-01","2010-09-01","2010-10-01","2010-11-01","2010-12-01","2011-01-01","2011-02-01","2011-03-01","2011-04-01","2011-05-01","2011-06-01","2011-07-01","2011-08-01","2011-09-01","2011-10-01","2011-11-01","2011-12-01","2012-01-01"]
["Residential Solid Waste Collected per Collection Day (Tons)",{"$error":"#N/A"},{"$error":"#N/A"},{"$error":"#N/A"},{"$error":"#N/A"},{"$error":"#N/A"},{"$error":"#N/A"},{"$error":"#N/A"},{"$error":"#N/A"},{"$error":"#N/A"},{"$error":"#N/A"},{"$error":"#N/A"},{"$error":"#N/A"},{"$error":"#N/A"},{"$error":"#N/A"},{"$error":"#N/A"},{"$error":"#N/A"},{"$error":"#N/A"},25.41,23.55,20.79,20.37,23.47,23.41,24.42,26.29,22.09,22.35,21.62,22.4,25.89,21.9,20.21,21.46,22.15,22.59,22.87,23.63,23.08,22.96,21.71,21.42,25.08,23.8]
["Commercial Solid Waste Collected per Collection Day (Tons)",{"$error":"#N/A"},{"$error":"#N/A"},{"$error":"#N/A"},{"$error":"#N/A"},{"$error":"#N/A"},{"$error":"#N/A"},{"$error":"#N/A"},{"$error":"#N/A"},{"$error":"#N/A"},{"$error":"#N/A"},{"$error":"#N/A"},{"$error":"#N/A"},{"$error":"#N/A"},{"$error":"#N/A"},{"$error":"#N/A"},{"$error":"#N/A"},{"$error":"#N/A"},20.93,19.5,19.690000000000001,20.82,21.9,21.15,20.9,19.05,20.22,20.49,20.420000000000002,18.260000000000002,19.97,18.239999999999998,19.96,23.67,19.7,18.52,17.96,17.899999999999999,17.63,17.350000000000001,18.010000000000002,16.309999999999999,17.48,18.899999999999999]
["Landfill Expense per Collection Day - Residential",{"$error":"#N/A"},{"$error":"#N/A"},{"$error":"#N/A"},{"$error":"#N/A"},{"$error":"#N/A"},{"$error":"#N/A"},{"$error":"#N/A"},{"$error":"#N/A"},{"$error":"#N/A"},{"$error":"#N/A"},{"$error":"#N/A"},{"$error":"#N/A"},{"$error":"#N/A"},{"$error":"#N/A"},{"$error":"#N/A"},{"$error":"#N/A"},{"$error":"#N/A"},711.48,659.4,582.08000000000004,570.36,657.16,655.48,683.76,782.37,618.52,625.69000000000005,605.36,627.13,724.92,613.20000000000005,565.87,600.92999999999995,620.20000000000005,632.52,640.36,661.64,646.24,642.74,607.84,599.76,702.24,666.4]
["Landfill Expense per Collection Day - Commercial",{"$error":"#N/A"},{"$error":"#N/A"},{"$error":"#N/A"},{"$error":"#N/A"},{"$error":"#N/A"},{"$error":"#N/A"},{"$error":"#N/A"},{"$error":"#N/A"},{"$error":"#N/A"},{"$error":"#N/A"},{"$error":"#N/A"},{"$error":"#N/A"},{"$error":"#N/A"},{"$error":"#N/A"},{"$error":"#N/A"},{"$error":"#N/A"},{"$error":"#N/A"},586.04,546.13,551.32000000000005,582.96,613.20000000000005,592.20000000000005,585.32000000000005,533.4,566.16,573.65,571.76,511.4,559.16,510.72,558.88,657.89,551.6,518.53,502.83,501.31,493.64,485.81,504.32,456.68,489.4,529.20000000000005]
["Average Number of Receptacles Collected per Route-hour",{"$error":"#N/A"},{"$error":"#N/A"},{"$error":"#N/A"},{"$error":"#N/A"},{"$error":"#N/A"},{"$error":"#N/A"},{"$error":"#N/A"},{"$error":"#N/A"},{"$error":"#N/A"},{"$error":"#N/A"},{"$error":"#N/A"},{"$error":"#N/A"},{"$error":"#N/A"},{"$error":"#N/A"},{"$error":"#N/A"},{"$error":"#N/A"},{"$error":"#N/A"},101,101,99,101,100,98,96,98,98,98,98,97,99,99,96,98,97,96,95,96,95,97,98,96,94,91]
["Curbies Missed While Conducting Normal Pick-up",{"$error":"#N/A"},{"$error":"#N/A"},{"$error":"#N/A"},{"$error":"#N/A"},{"$error":"#N/A"},{"$error":"#N/A"},{"$error":"#N/A"},{"$error":"#N/A"},{"$error":"#N/A"},{"$error":"#N/A"},{"$error":"#N/A"},{"$error":"#N/A"},{"$error":"#N/A"},{"$error":"#N/A"},{"$error":"#N/A"},{"$error":"#N/A"},{"$error":"#N/A"},11,9,5,17,9,6,14,13,10,17,8,10,10,12,4,10,5,5,6,8,11,7,3,0,0,0]
["Complaints Received",{"$error":"#N/A"},{"$error":"#N/A"},{"$error":"#N/A"},{"$error":"#N/A"},{"$error":"#N/A"},{"$error":"#N/A"},{"$error":"#N/A"},{"$error":"#N/A"},{"$error":"#N/A"},{"$error":"#N/A"},{"$error":"#N/A"},{"$error":"#N/A"},{"$error":"#N/A"},{"$error":"#N/A"},{"$error":"#N/A"},{"$error":"#N/A"},{"$error":"#N/A"},10,11,12,17,9,6,14,13,10,17,9,11,12,14,4,10,5,5,6,7,11,7,3,0,0,0]
["Staff Injuries (Solid Waste)",{"$error":"#N/A"},{"$error":"#N/A"},{"$error":"#N/A"},{"$error":"#N/A"},{"$error":"#N/A"},{"$error":"#N/A"},{"$error":"#N/A"},{"$error":"#N/A"},{"$error":"#N/A"},{"$error":"#N/A"},{"$error":"#N/A"},{"$error":"#N/A"},{"$error":"#N/A"},{"$error":"#N/A"},{"$error":"#N/A"},{"$error":"#N/A"},{"$error":"#N/A"},0,1,0,1,0,0,0,0,0,0,0,0,0,0,1,0,0,0,0,0,0,1,0,0,1,1]
[]
[]
[]
[]
[]
[]
[]
[]
[]
[]
[]
[]
[]
[]
["HIGHLIGHTS","2008-07-01","2008-08-01","2008-09-01","2008-10-01","2008-11-01","2008-12-01","2009-01-01","2009-02-01","2009-03-01","2009-04-01","2009-05-01","2009-06-01","2009-07-01","2009-08-01","2009-09-01","2009-10-01","2009-11-01","2009-12-01","2010-01-01","2010-02-01","2010-03-01","2010-04-01","2010-05-01","2010-06-01","2010-07-01","2010-08-01","2010-09-01","2010-10-01","2010-11-01","2010-12-01","2011-01-01","2011-02-01","2011-03-01","2011-04-01","2011-05-01","2011-06-01","2011-07-01","2011-08-01","2011-09-01","2011-10-01","2011-11-01","2011-12-01","2012-01-01"]
["Highlight 1",null,null,null,null,null,null,null,null,null,null,null,null,null,null,null,null,null,null,null,null,null,null,null,null,null,null,null,null,null,null,null,null,null,null,null,null,null,"1. Began Pilot Recycling program in August.  There are 20 participants and valuable data is being collected.  Program is scheduled to extend through October.","1.  Pilot Recycling program continuing.  There are 20 participants and valuable data is being collected.  Program is scheduled to extend through October.","Pilot Recycling program continued through October.","New Recycling truck is scheduled for delivery the week after Christmas.","During the month of December, there were 527 customers to sign up for recycling.","Began delivering recycling containers to customers who signed up for the recycling program."]
["Highlight 2",null,null,null,null,null,null,null,null,null,null,null,null,null,null,null,null,null,null,null,null,null,null,null,null,null,null,null,null,null,null,null,null,null,null,null,null,null,"2. Have begun to evaluate recycling vehicles in preparation for Program Startup in January.","2.  We have received over 150 responses from citizens interested in participating in the upcoming curbside recycling program.  The program is actively being promoted through the City Newsletter as well as through social media.","Bid proposals for a recycling truck were received on October 14, 2011.",null,null,"By the end of January, we had 1,015 participants registered for recycling."]
["Highlight 3",null,null,null,null,null,null,null,null,null,null,null,null,null,null,null,null,null,null,null,null,null,null,null,null,null,null,null,null,null,null,null,null,null,null,null,null,null,null,"3.  Taking bid proposals on a Recycling Truck on October 14, 2011."]
["Highlight 4"]
["Highlight 5"]
["Highlight 6"]
["Highlight 7"]
["Highlight 8"]
["Highlights Concaetenation",{"$f":"B28&CHAR(10)&B29&CHAR(10)&B30&CHAR(10)&B31&CHAR(10)&B32&CHAR(10)&B33&CHAR(10)&B34&CHAR(10)&B35","v":"\n\n\n\n\n\n\n"},{"$f":"C28&CHAR(10)&C29&CHAR(10)&C30&CHAR(10)&C31&CHAR(10)&C32&CHAR(10)&C33&CHAR(10)&C34&CHAR(10)&C35","v":"\n\n\n\n\n\n\n"},"\n\n\n\n\n\n\n","\n\n\n\n\n\n\n","\n\n\n\n\n\n\n","\n\n\n\n\n\n\n","\n\n\n\n\n\n\n","\n\n\n\n\n\n\n","\n\n\n\n\n\n\n","\n\n\n\n\n\n\n","\n\n\n\n\n\n\n","\n\n\n\n\n\n\n","\n\n\n\n\n\n\n","\n\n\n\n\n\n\n","\n\n\n\n\n\n\n","\n\n\n\n\n\n\n","\n\n\n\n\n\n\n","\n\n\n\n\n\n\n","\n\n\n\n\n\n\n","\n\n\n\n\n\n\n","\n\n\n\n\n\n\n","\n\n\n\n\n\n\n","\n\n\n\n\n\n\n","\n\n\n\n\n\n\n","\n\n\n\n\n\n\n","\n\n\n\n\n\n\n","\n\n\n\n\n\n\n","\n\n\n\n\n\n\n","\n\n\n\n\n\n\n","\n\n\n\n\n\n\n","\n\n\n\n\n\n\n","\n\n\n\n\n\n\n","\n\n\n\n\n\n\n","\n\n\n\n\n\n\n",{"$f":"AJ28&CHAR(10)&AJ29&CHAR(10)&AJ30&CHAR(10)&AJ31&CHAR(10)&AJ32&CHAR(10)&AJ33&CHAR(10)&AJ34&CHAR(10)&AJ35","v":"\n\n\n\n\n\n\n"},"\n\n\n\n\n\n\n","\n\n\n\n\n\n\n",{"$f":"AM28&CHAR(10)&CHAR(10)&AM29&CHAR(10)&CHAR(10)&AM30&CHAR(10)&CHAR(10)&AM31&CHAR(10)&CHAR(10)&AM32&CHAR(10)&CHAR(10)&AM33&CHAR(10)&CHAR(10)&AM34&CHAR(10)&CHAR(10)&AM35","v":"1. Began Pilot Recycling program in August.  There are 20 participants and valuable data is being collected.  Program is scheduled to extend through October.\n\n2. Have begun to evaluate recycling vehicles in preparation for Program Startup in January.\n\n\n\n\n\n\n\n\n\n\n\n"},"1.  Pilot Recycling program continuing.  There are 20 participants and valuable data is being collected.  Program is scheduled to extend through October.\n\n2.  We have received over 150 responses from citizens interested in participating in the upcoming curbside recycling program.  The program is actively being promoted through the City Newsletter as well as through social media.\n\n3.  Taking bid proposals on a Recycling Truck on October 14, 2011.\n\n\n\n\n\n\n\n\n\n","Pilot Recycling program continued through October.\n\nBid proposals for a recycling truck were received on October 14, 2011.\n\n\n\n\n\n\n\n\n\n\n\n","New Recycling truck is scheduled for delivery the week after Christmas.\n\n\n\n\n\n\n\n\n\n\n\n\n\n","During the month of December, there were 527 customers to sign up for recycling.\n\n\n\n\n\n\n\n\n\n\n\n\n\n","Began delivering recycling containers to customers who signed up for the recycling program.\n\nBy the end of January, we had 1,015 participants registered for recycling.\n\n\n\n\n\n\n\n\n\n\n\n"]
[]
[]
[]
["Bullet Chart Source","Target","What's Better?","Band 1","Band 2","YTD Type","Max Scale","Actual 1","Actual","Actual 3","Projection 1","Projection 2","Projection 3","First Zone 1","First Zone 2","First Zone 3","Second Zone 1","Second Zone 2","Second Zone 3","Previous X 1","Previous X 2","Previous Y 1","Previous Y 2"]
[{"$f":"A5","v":"Residential Solid Waste Collected per Collection Day (Tons)"},23,"Less",1,1.1499999999999999,"Average",{"$f":"ROUNDUP((ROUNDUP(MAX(B41,SUM(I41,L41)),-LEN(EVEN(MAX(B41,SUM(I41,L41))))+2)/5),-LEN(EVEN(ROUNDUP(MAX(B41,SUM(I41,L41)),-LEN(EVEN(MAX(B41,SUM(I41,L41))))+2)/5))+1)*5","v":25},0,{"$f":"IF(F41=\"Sum\",SUM(OFFSET(A5,0,YTDBeg,1,YTDWidth)),AVERAGE(OFFSET(A5,0,YTDBeg,1,YTDWidth)))","v":23.09714285714286},0,0,{"$f":"IF(F41=\"Sum\",Projection*(I41/YTDWidth*12-I41),0)","v":0},0,{"$f":"B41*D41","v":23},{"$f":"((I41+L41<=N41)*(N41-(I41+L41)))","v":0},{"$f":"N41","v":23},{"$f":"(E41-D41)*B41","v":3.449999999999998},{"$f":"((I41+L41<=N41+Q41)*((N41+Q41)-(I41+L41+O41)))","v":3.3528571428571396},{"$f":"Q41","v":3.449999999999998},{"$f":"IF(F41=\"Sum\",SUM(OFFSET(A5,0,YTDBeg-12,1,YTDWidth)),AVERAGE(OFFSET(A5,0,YTDBeg-12,1,YTDWidth)))","v":23.22},{"$f":"T41","v":23.22},1,2]
[{"$f":"A6","v":"Commercial Solid Waste Collected per Collection Day (Tons)"},20,"Less",1,1.1499999999999999,"Average",{"$f":"ROUNDUP((ROUNDUP(MAX(B42,SUM(I42,L42)),-LEN(EVEN(MAX(B42,SUM(I42,L42))))+2)/5),-LEN(EVEN(ROUNDUP(MAX(B42,SUM(I42,L42)),-LEN(EVEN(MAX(B42,SUM(I42,L42))))+2)/5))+1)*5","v":20},0,17.654285714285717,0,0,0,0,20,{"$f":"((I42+L42<=N42)*(N42-(I42+L42)))","v":2.3457142857142834},{"$f":"N42","v":20},2.9999999999999982,{"$f":"((I42+L42<=N42+Q42)*((N42+Q42)-(I42+L42+O42)))","v":3},{"$f":"Q42","v":2.9999999999999982},19.521428571428572,{"$f":"T42","v":19.521428571428572},1,2]
["Landfill Expense per Collection Day - Residential",649,"Less",1,1.1499999999999999,"Average",1000,0,646.69428571428568,0,0,0,0,649,2.3057142857143162,649,97.349999999999937,97.349999999999909,97.349999999999937,656.74142857142863,656.74142857142863,1,2]
["Landfill Expense per Collection Day - Commercial",566,"Less",1,1.1499999999999999,"Average",1000,0,494.33714285714279,0,0,0,0,566,71.662857142857206,566,84.899999999999949,84.899999999999977,84.899999999999949,546.60714285714289,546.60714285714289,1,2]
["Average Number of Receptacles Collected per Route-hour",99,"More",0.85,1,"Average",100,0,95.285714285714292,0,0,0,0,84.149999999999991,0,84.149999999999991,14.850000000000001,3.7142857142857082,14.850000000000001,98.142857142857139,98.142857142857139,1,2]
["Curbies Missed While Conducting Normal Pick-up",128,"Less",1,1.1499999999999999,"Sum",150,0,29,0,0,0,0,128,99,128,19.199999999999989,19.199999999999989,19.199999999999989,80,80,1,2]
["Complaints Received",141,"Less",1,1.1499999999999999,"Sum",150,0,28,0,0,0,0,141,113,141,21.149999999999988,21.149999999999977,21.149999999999988,86,86,1,2]
["Staff Injuries (Solid Waste)",2,"Less",1,1.1499999999999999,"Sum",5,0,3,0,0,0,0,2,0,2,0.29999999999999982,0,0.29999999999999982,0,0,1,2]
[]
[]
[]
[]
[]
[]
[]
[]
[]
[]
[]
[]
[]
[]
[]
[]
["SPARKLINE SOURCE"]
[null,11,10,9,8,7,6,5,4,3,2,1,0]
["Measure",{"$f":"OFFSET($A4,0,CurrentMonthCount-B$66,1,1)","v":"2011-02-01"},"2011-03-01","2011-04-01","2011-05-01","2011-06-01","2011-07-01","2011-08-01","2011-09-01","2011-10-01","2011-11-01","2011-12-01","2012-01-01"]
[{"$f":"A5","v":"Residential Solid Waste Collected per Collection Day (Tons)"},20.21,21.46,22.15,22.59,22.87,23.63,23.08,22.96,21.71,21.42,25.08,23.8]
[{"$f":"A6","v":"Commercial Solid Waste Collected per Collection Day (Tons)"},19.96,23.67,19.7,18.52,17.96,17.899999999999999,17.63,17.350000000000001,18.010000000000002,16.309999999999999,17.48,18.899999999999999]
["Landfill Expense per Collection Day - Residential",565.87,600.92999999999995,620.20000000000005,632.52,640.36,661.64,646.24,642.74,607.84,599.76,702.24,666.4]
["Landfill Expense per Collection Day - Commercial",558.88,657.89,551.6,518.53,502.83,501.31,493.64,485.81,504.32,456.68,489.4,529.20000000000005]
["Average Number of Receptacles Collected per Route-hour",96,98,97,96,95,96,95,97,98,96,94,91]
["Curbies Missed While Conducting Normal Pick-up",4,10,5,5,6,8,11,7,3,0,0,0]
["Complaints Received",4,10,5,5,6,7,11,7,3,0,0,0]
["Staff Injuries (Solid Waste)",1,0,0,0,0,0,0,1,0,0,1,1]
[0,0,0,0,0,0,0,0,0,0,0,0,0]
[0,0,0,0,0,0,0,0,0,0,0,0,0]
[0,0,0,0,0,0,0,0,0,0,0,0,0]
[0,0,0,0,0,0,0,0,0,0,0,0,0]
[0,0,0,0,0,0,0,0,0,0,0,0,0]
[0,0,0,0,0,0,0,0,0,0,0,0,0]
[0,0,0,0,0,0,0,0,0,0,0,0,0]
[0,{"$f":"OFFSET($A20,0,CurrentMonthCount-B$66,1,1)","v":0},0,0,0,0,0,0,0,0,0,0,0]
[0,0,0,0,0,0,0,0,0,0,0,0,0]
[0,0,0,0,0,0,0,0,0,0,0,0,0]
[0,0,0,0,0,0,0,0,0,0,0,0,0]
[0,0,0,0,0,0,0,0,0,0,0,0,0]

{"sheet":"Storm","index":27,"n_rows":7,"n_cols":9,"rows_kept":7,"cut":false,"hidden":false,"merged":[]}
[{"$f":"CurrentMonth","v":"2012-01-01"},null,null,null,"STORMWATER"]
[]
["Maintenance","Last 12 Months","Fiscal Year to Date","FYTD",null,"Flooding","Last 12 Months","Fiscal Year to Date","FYTD"]
[{"$f":"'Storm Data'!A5","v":"Catch Basins Cleaned"},null,null,{"$f":"'Storm Data'!I41","v":1229},null,{"$f":"'Storm Data'!A9","v":"Flooding Occurances Reported"},null,null,{"$f":"'Storm Data'!I45","v":25}]
[{"$f":"'Storm Data'!A6","v":"Storm Pipe Cleaned (Linear Feet)"},null,null,{"$f":"'Storm Data'!I42","v":1735}]
[{"$f":"'Storm Data'!A7","v":"Ditch Cleaned/Dug Out/Mowed"},null,null,{"$f":"'Storm Data'!I43","v":6378}]
[{"$f":"'Storm Data'!A8","v":"Street Sweeping Miles per Day"},null,null,{"$f":"'Storm Data'!I44","v":48.688571428571429}]

{"sheet":"Storm Data","index":28,"n_rows":108,"n_cols":44,"rows_kept":108,"cut":false,"hidden":true,"merged":[]}
["Storm Data"]
[]
[]
["Measure","2008-07-01","2008-08-01","2008-09-01","2008-10-01","2008-11-01","2008-12-01","2009-01-01","2009-02-01","2009-03-01","2009-04-01","2009-05-01","2009-06-01","2009-07-01","2009-08-01","2009-09-01","2009-10-01","2009-11-01","2009-12-01","2010-01-01","2010-02-01","2010-03-01","2010-04-01","2010-05-01","2010-06-01","2010-07-01","2010-08-01","2010-09-01","2010-10-01","2010-11-01","2010-12-01","2011-01-01","2011-02-01","2011-03-01","2011-04-01","2011-05-01","2011-06-01","2011-07-01","2011-08-01","2011-09-01","2011-10-01","2011-11-01","2011-12-01","2012-01-01"]
["Catch Basins Cleaned",{"$error":"#N/A"},{"$error":"#N/A"},{"$error":"#N/A"},{"$error":"#N/A"},{"$error":"#N/A"},{"$error":"#N/A"},{"$error":"#N/A"},{"$error":"#N/A"},{"$error":"#N/A"},{"$error":"#N/A"},{"$error":"#N/A"},{"$error":"#N/A"},{"$error":"#N/A"},{"$error":"#N/A"},{"$error":"#N/A"},{"$error":"#N/A"},{"$error":"#N/A"},100,801,254,263,106,448,167,206,140,201,795,240,254,348,94,382,264,60,247,6,60,278,61,614,157,53]
["Storm Pipe Cleaned (Linear Feet)",{"$error":"#N/A"},{"$error":"#N/A"},{"$error":"#N/A"},{"$error":"#N/A"},{"$error":"#N/A"},{"$error":"#N/A"},{"$error":"#N/A"},{"$error":"#N/A"},{"$error":"#N/A"},{"$error":"#N/A"},{"$error":"#N/A"},{"$error":"#N/A"},{"$error":"#N/A"},{"$error":"#N/A"},{"$error":"#N/A"},{"$error":"#N/A"},{"$error":"#N/A"},80,229,20,140,0,1050,30,220,525,0,0,155,0,0,0,1115,0,0,320,855,0,0,0,125,125,630]
["Ditch Cleaned/Dug Out/Mowed",{"$error":"#N/A"},{"$error":"#N/A"},{"$error":"#N/A"},{"$error":"#N/A"},{"$error":"#N/A"},{"$error":"#N/A"},{"$error":"#N/A"},{"$error":"#N/A"},{"$error":"#N/A"},{"$error":"#N/A"},{"$error":"#N/A"},{"$error":"#N/A"},{"$error":"#N/A"},{"$error":"#N/A"},{"$error":"#N/A"},{"$error":"#N/A"},{"$error":"#N/A"},115,1810,455,290,585,1390,2365,825,4700,480,150,525,710,75,310,695,545,100,700,3505,605,623,155,940,225,325]
["Street Sweeping Miles per Day",{"$error":"#N/A"},{"$error":"#N/A"},{"$error":"#N/A"},{"$error":"#N/A"},{"$error":"#N/A"},{"$error":"#N/A"},{"$error":"#N/A"},{"$error":"#N/A"},{"$error":"#N/A"},{"$error":"#N/A"},{"$error":"#N/A"},{"$error":"#N/A"},{"$error":"#N/A"},{"$error":"#N/A"},{"$error":"#N/A"},{"$error":"#N/A"},{"$error":"#N/A"},62.5,56.33,42.48,51.26,49.625,51.2,46.82,50.81,52.41,47,52.81,45.65,40.85,44.43,53.4,54.04,40.81,35.5,55.18,44.85,37.74,54.05,36.479999999999997,64,51,52.7]
["Flooding Occurances Reported",{"$error":"#N/A"},{"$error":"#N/A"},{"$error":"#N/A"},{"$error":"#N/A"},{"$error":"#N/A"},{"$error":"#N/A"},{"$error":"#N/A"},{"$error":"#N/A"},{"$error":"#N/A"},{"$error":"#N/A"},{"$error":"#N/A"},{"$error":"#N/A"},{"$error":"#N/A"},{"$error":"#N/A"},{"$error":"#N/A"},{"$error":"#N/A"},{"$error":"#N/A"},0,0,0,0,0,0,0,32,0,0,0,0,0,0,0,0,0,0,0,25,0,0,0,0,0,0]
[]
[]
[]
[]
[]
[]
[]
[]
[]
[]
[]
[]
[]
[]
[]
[]
[]
["HIGHLIGHTS","2008-07-01","2008-08-01","2008-09-01","2008-10-01","2008-11-01","2008-12-01","2009-01-01","2009-02-01","2009-03-01","2009-04-01","2009-05-01","2009-06-01","2009-07-01","2009-08-01","2009-09-01","2009-10-01","2009-11-01","2009-12-01","2010-01-01","2010-02-01","2010-03-01","2010-04-01","2010-05-01","2010-06-01","2010-07-01","2010-08-01","2010-09-01","2010-10-01","2010-11-01","2010-12-01","2011-01-01","2011-02-01","2011-03-01","2011-04-01","2011-05-01","2011-06-01","2011-07-01","2011-08-01","2011-09-01","2011-10-01","2011-11-01","2011-12-01","2012-01-01"]
["Highlight 1",null,null,null,null,null,null,null,null,null,null,null,null,null,null,null,null,null,null,null,null,null,null,null,null,null,null,null,null,null,null,null,null,null,null,null,null,null,"1. Work cleaning the Railroad ditch is proceeding.  This work is being done to ease the flooding issues in the Church Street Basin.  This work should be completed by the end of September 2011.","1. Railroad Ditch Project almost completed.","Railroad Ditch Project Completed",null,"Work has begun on the West Avenue/Etowah Drive Storm drainage box repairs.","Work continues on the West Ave/Etowah Drive storm drainage box repairs."]
["Highlight 2",null,null,null,null,null,null,null,null,null,null,null,null,null,null,null,null,null,null,null,null,null,null,null,null,null,null,null,null,null,null,null,null,null,null,null,null,null,"2. Cleaned out two detention ponds on Center Road and one behind the Kmart Shopping Center.  The pond outlet structures were throttled back to help downstream flooding issues connected with the Church Street Basin.","2. Preparing to begin work at Bob White Trail and at West Avenue and Etowah Drive.","Bob White Trail Project completed.",null,null,"Installed new cross drain pipe across Luckie Street at #1 Valley Drive."]
["Highlight 3",null,null,null,null,null,null,null,null,null,null,null,null,null,null,null,null,null,null,null,null,null,null,null,null,null,null,null,null,null,null,null,null,null,null,null,null,null,null,null,"Drainage project at West Avenue and Etowah Drive scheduled."]
["Highlight 4"]
["Highlight 5"]
["Highlight 6"]
["Highlight 7"]
["Highlight 8"]
["Highlights Concaetenation",{"$f":"B28&CHAR(10)&B29&CHAR(10)&B30&CHAR(10)&B31&CHAR(10)&B32&CHAR(10)&B33&CHAR(10)&B34&CHAR(10)&B35","v":"\n\n\n\n\n\n\n"},{"$f":"C28&CHAR(10)&C29&CHAR(10)&C30&CHAR(10)&C31&CHAR(10)&C32&CHAR(10)&C33&CHAR(10)&C34&CHAR(10)&C35","v":"\n\n\n\n\n\n\n"},"\n\n\n\n\n\n\n","\n\n\n\n\n\n\n","\n\n\n\n\n\n\n","\n\n\n\n\n\n\n","\n\n\n\n\n\n\n","\n\n\n\n\n\n\n","\n\n\n\n\n\n\n","\n\n\n\n\n\n\n","\n\n\n\n\n\n\n","\n\n\n\n\n\n\n","\n\n\n\n\n\n\n","\n\n\n\n\n\n\n","\n\n\n\n\n\n\n","\n\n\n\n\n\n\n","\n\n\n\n\n\n\n","\n\n\n\n\n\n\n","\n\n\n\n\n\n\n","\n\n\n\n\n\n\n","\n\n\n\n\n\n\n","\n\n\n\n\n\n\n","\n\n\n\n\n\n\n","\n\n\n\n\n\n\n","\n\n\n\n\n\n\n","\n\n\n\n\n\n\n","\n\n\n\n\n\n\n","\n\n\n\n\n\n\n","\n\n\n\n\n\n\n","\n\n\n\n\n\n\n","\n\n\n\n\n\n\n","\n\n\n\n\n\n\n","\n\n\n\n\n\n\n",{"$f":"AI28&CHAR(10)&CHAR(10)&AI29&CHAR(10)&CHAR(10)&AI30&CHAR(10)&CHAR(10)&AI31&CHAR(10)&CHAR(10)&AI32&CHAR(10)&CHAR(10)&AI33&CHAR(10)&CHAR(10)&AI34&CHAR(10)&CHAR(10)&AI35","v":"\n\n\n\n\n\n\n\n\n\n\n\n\n\n"},"\n\n\n\n\n\n\n\n\n\n\n\n\n\n","\n\n\n\n\n\n\n\n\n\n\n\n\n\n","\n\n\n\n\n\n\n\n\n\n\n\n\n\n","1. Work cleaning the Railroad ditch is proceeding.  This work is being done to ease the flooding issues in the Church Street Basin.  This work should be completed by the end of September 2011.\n\n2. Cleaned out two detention ponds on Center Road and one behind the Kmart Shopping Center.  The pond outlet structures were throttled back to help downstream flooding issues connected with the Church Street Basin.\n\n\n\n\n\n\n\n\n\n\n\n",{"$f":"AN28&CHAR(10)&CHAR(10)&AN29&CHAR(10)&CHAR(10)&AN30&CHAR(10)&CHAR(10)&AN31&CHAR(10)&CHAR(10)&AN32&CHAR(10)&CHAR(10)&AN33&CHAR(10)&CHAR(10)&AN34&CHAR(10)&CHAR(10)&AN35","v":"1. Railroad Ditch Project almost completed.\n\n2. Preparing to begin work at Bob White Trail and at West Avenue and Etowah Drive.\n\n\n\n\n\n\n\n\n\n\n\n"},{"$f":"AO28&CHAR(10)&CHAR(10)&AO29&CHAR(10)&CHAR(10)&AO30&CHAR(10)&CHAR(10)&AO31&CHAR(10)&CHAR(10)&AO32&CHAR(10)&CHAR(10)&AO33&CHAR(10)&CHAR(10)&AO34&CHAR(10)&CHAR(10)&AO35","v":"Railroad Ditch Project Completed\n\nBob White Trail Project completed.\n\nDrainage project at West Avenue and Etowah Drive scheduled.\n\n\n\n\n\n\n\n\n\n"},{"$f":"AP28&CHAR(10)&CHAR(10)&AP29&CHAR(10)&CHAR(10)&AP30&CHAR(10)&CHAR(10)&AP31&CHAR(10)&CHAR(10)&AP32&CHAR(10)&CHAR(10)&AP33&CHAR(10)&CHAR(10)&AP34&CHAR(10)&CHAR(10)&AP35","v":"\n\n\n\n\n\n\n\n\n\n\n\n\n\n"},{"$f":"AQ28&CHAR(10)&CHAR(10)&AQ29&CHAR(10)&CHAR(10)&AQ30&CHAR(10)&CHAR(10)&AQ31&CHAR(10)&CHAR(10)&AQ32&CHAR(10)&CHAR(10)&AQ33&CHAR(10)&CHAR(10)&AQ34&CHAR(10)&CHAR(10)&AQ35","v":"Work has begun on the West Avenue/Etowah Drive Storm drainage box repairs.\n\n\n\n\n\n\n\n\n\n\n\n\n\n"},{"$f":"AR28&CHAR(10)&CHAR(10)&AR29&CHAR(10)&CHAR(10)&AR30&CHAR(10)&CHAR(10)&AR31&CHAR(10)&CHAR(10)&AR32&CHAR(10)&CHAR(10)&AR33&CHAR(10)&CHAR(10)&AR34&CHAR(10)&CHAR(10)&AR35","v":"Work continues on the West Ave/Etowah Drive storm drainage box repairs.\n\nInstalled new cross drain pipe across Luckie Street at #1 Valley Drive.\n\n\n\n\n\n\n\n\n\n\n\n"}]
[]
[]
[]
["Bullet Chart Source","Target","What's Better?","Band 1","Band 2","YTD Type","Max Scale","Actual 1","Actual","Actual 3","Projection 1","Projection 2","Projection 3","First Zone 1","First Zone 2","First Zone 3","Second Zone 1","Second Zone 2","Second Zone 3","Previous X 1","Previous X 2","Previous Y 1","Previous Y 2"]
[{"$f":"A5","v":"Catch Basins Cleaned"},3875,"More",0.85,1,"Sum",{"$f":"ROUNDUP((ROUNDUP(MAX(B41,SUM(I41,L41)),-LEN(EVEN(MAX(B41,SUM(I41,L41))))+2)/5),-LEN(EVEN(ROUNDUP(MAX(B41,SUM(I41,L41)),-LEN(EVEN(MAX(B41,SUM(I41,L41))))+2)/5))+1)*5","v":4000},0,{"$f":"IF(F41=\"Sum\",SUM(OFFSET(A5,0,YTDBeg,1,YTDWidth)),AVERAGE(OFFSET(A5,0,YTDBeg,1,YTDWidth)))","v":1229},0,0,{"$f":"IF(F41=\"Sum\",Projection*(I41/YTDWidth*12-I41),0)","v":0},0,{"$f":"B41*D41","v":3293.75},{"$f":"((I41+L41<=N41)*(N41-(I41+L41)))","v":2064.75},{"$f":"N41","v":3293.75},{"$f":"(E41-D41)*B41","v":581.25000000000011},{"$f":"((I41+L41<=N41+Q41)*((N41+Q41)-(I41+L41+O41)))","v":581.25},{"$f":"Q41","v":581.25000000000011},{"$f":"IF(F41=\"Sum\",SUM(OFFSET(A5,0,YTDBeg-12,1,YTDWidth)),AVERAGE(OFFSET(A5,0,YTDBeg-12,1,YTDWidth)))","v":2184},{"$f":"T41","v":2184},1,2]
[{"$f":"A6","v":"Storm Pipe Cleaned (Linear Feet)"},2369,"More",0.85,1,"Sum",{"$f":"ROUNDUP((ROUNDUP(MAX(B42,SUM(I42,L42)),-LEN(EVEN(MAX(B42,SUM(I42,L42))))+2)/5),-LEN(EVEN(ROUNDUP(MAX(B42,SUM(I42,L42)),-LEN(EVEN(MAX(B42,SUM(I42,L42))))+2)/5))+1)*5","v":2500},0,1735,0,0,0,0,2013.6499999999999,{"$f":"((I42+L42<=N42)*(N42-(I42+L42)))","v":278.64999999999986},{"$f":"N42","v":2013.6499999999999},355.35000000000008,{"$f":"((I42+L42<=N42+Q42)*((N42+Q42)-(I42+L42+O42)))","v":355.35000000000014},{"$f":"Q42","v":355.35000000000008},900,{"$f":"T42","v":900},1,2]
["Ditch Cleaned/Dug Out/Mowed",14285,"More",0.85,1,"Sum",15000,0,6378,0,0,0,0,12142.25,5764.25,12142.25,2142.7500000000005,2142.75,2142.7500000000005,7465,7465,1,2]
["Street Sweeping Miles per Day",49,"More",0.85,1,"Average",50,0,48.688571428571429,0,0,0,0,41.65,0,41.65,7.3500000000000014,0.31142857142857139,7.3500000000000014,47.708571428571432,47.708571428571432,1,2]
["Flooding Occurances Reported",32,"Less",1,1.1499999999999999,"Sum",35,0,25,0,0,0,0,32,7,32,4.7999999999999972,4.7999999999999972,4.7999999999999972,32,32,1,2]
[]
[]
[]
[]
[]
[]
[]
[]
[]
[]
[]
[]
[]
[]
[]
[]
[]
[]
[]
["SPARKLINE SOURCE"]
[null,11,10,9,8,7,6,5,4,3,2,1,0]
["Measure",{"$f":"OFFSET($A4,0,CurrentMonthCount-B$66,1,1)","v":"2011-02-01"},"2011-03-01","2011-04-01","2011-05-01","2011-06-01","2011-07-01","2011-08-01","2011-09-01","2011-10-01","2011-11-01","2011-12-01","2012-01-01"]
[{"$f":"A5","v":"Catch Basins Cleaned"},94,382,264,60,247,6,60,278,61,614,157,53]
[{"$f":"A6","v":"Storm Pipe Cleaned (Linear Feet)"},0,1115,0,0,320,855,0,0,0,125,125,630]
["Ditch Cleaned/Dug Out/Mowed",310,695,545,100,700,3505,605,623,155,940,225,325]
["Street Sweeping Miles per Day",53.4,54.04,40.81,35.5,55.18,44.85,37.74,54.05,36.479999999999997,64,51,52.7]
["Flooding Occurances Reported",0,0,0,0,0,25,0,0,0,0,0,0]
[0,0,0,0,0,0,0,0,0,0,0,0,0]
[0,0,0,0,0,0,0,0,0,0,0,0,0]
[0,0,0,0,0,0,0,0,0,0,0,0,0]
[0,0,0,0,0,0,0,0,0,0,0,0,0]
[0,0,0,0,0,0,0,0,0,0,0,0,0]
[0,0,0,0,0,0,0,0,0,0,0,0,0]
[0,0,0,0,0,0,0,0,0,0,0,0,0]
[0,0,0,0,0,0,0,0,0,0,0,0,0]
[0,0,0,0,0,0,0,0,0,0,0,0,0]
[0,0,0,0,0,0,0,0,0,0,0,0,0]
[0,{"$f":"OFFSET($A20,0,CurrentMonthCount-B$66,1,1)","v":0},0,0,0,0,0,0,0,0,0,0,0]
[0,0,0,0,0,0,0,0,0,0,0,0,0]
[0,0,0,0,0,0,0,0,0,0,0,0,0]
[0,0,0,0,0,0,0,0,0,0,0,0,0]
[0,0,0,0,0,0,0,0,0,0,0,0,0]
[]
[]
[]
[]
[]
[]
[]
[]
[]
[]
[]
[]
["Photos"]
[]
[]
[]
["Stormwater Crews at work cleaning out the storm drainage ditch next to the railroad in Downtown Cartersville.  The Ditch Cleaning Project is intended to mitigate the flooding that affects many businesses near the railroad."]
["The City worked with CSX to gain access to the right-of-way owned by CSX, where the work was performed."]
["Stormwater crews installed an underground pipe on the East side of the railroad to channel stormwater runoff away from Downtown businesses."]
["A newly installed catch basin."]
["New catch basin cover."]

{"sheet":"Fiber","index":29,"n_rows":11,"n_cols":9,"rows_kept":11,"cut":false,"hidden":false,"merged":[]}
[{"$f":"CurrentMonth","v":"2012-01-01"},null,null,null,"FIBERCOM"]
[]
["Business","Last 12 Months","Fiscal Year to Date","FYTD",null,"Customer Service","Last 12 Months","Fiscal Year to Date","FYTD"]
[{"$f":"'Fiber Data'!A5","v":"Revenue - Enterprise"},null,null,{"$f":"'Fiber Data'!I41","v":371316.6},null,{"$f":"'Fiber Data'!A9","v":"Enterprise:  Technical Issues Reported"},null,null,{"$f":"'Fiber Data'!I45","v":5}]
[{"$f":"'Fiber Data'!A6","v":"Revenue - City"},null,null,{"$f":"'Fiber Data'!I42","v":535715.26},null,{"$f":"'Fiber Data'!A10","v":"Enterprise:  Phone Outages Reported"},null,null,{"$f":"'Fiber Data'!I46","v":18}]
[{"$f":"'Fiber Data'!A7","v":"Net Increase/Decrease in Customer Count (Enterprise)"},null,null,{"$f":"'Fiber Data'!I43","v":2},null,{"$f":"'Fiber Data'!A11","v":"Enterprise:  Internet Outages Reported"},null,null,{"$f":"'Fiber Data'!I47","v":2}]
[{"$f":"'Fiber Data'!A8","v":"Net Increase/Decrease in Contract Value (Enterprise)"},null,null,{"$f":"'Fiber Data'!I44","v":56391},null,{"$f":"'Fiber Data'!A12","v":"Enterprise:  Billing Errors Reported"},null,null,{"$f":"'Fiber Data'!I48","v":0}]
[null,null,null,null,null,{"$f":"'Fiber Data'!A13","v":"Service Change Request:  Add Service"},null,null,{"$f":"'Fiber Data'!I49","v":11}]
["City Service",null,null,null,null,{"$f":"'Fiber Data'!A14","v":"Service Change Request:  Remove Service"},null,null,{"$f":"'Fiber Data'!I50","v":6}]
[{"$f":"'Fiber Data'!A17","v":"Total Support Requests (City)"},null,null,{"$f":"'Fiber Data'!I53","v":1398},null,{"$f":"'Fiber Data'!A15","v":"Service Change Request:  Move Service"},null,null,{"$f":"'Fiber Data'!I51","v":1}]
[{"$f":"'Fiber Data'!A18","v":"Cell Minutes Consumed (City)"},null,null,{"$f":"'Fiber Data'!I54","v":251304},null,{"$f":"'Fiber Data'!A16","v":"Total Support Requests (Enterprise)"},null,null,{"$f":"'Fiber Data'!I52","v":43}]

{"sheet":"Fiber Data","index":30,"n_rows":103,"n_cols":44,"rows_kept":103,"cut":false,"hidden":true,"merged":[]}
["Fiber Data"]
[]
[]
["Measure","2008-07-01","2008-08-01","2008-09-01","2008-10-01","2008-11-01","2008-12-01","2009-01-01","2009-02-01","2009-03-01","2009-04-01","2009-05-01","2009-06-01","2009-07-01","2009-08-01","2009-09-01","2009-10-01","2009-11-01","2009-12-01","2010-01-01","2010-02-01","2010-03-01","2010-04-01","2010-05-01","2010-06-01","2010-07-01","2010-08-01","2010-09-01","2010-10-01","2010-11-01","2010-12-01","2011-01-01","2011-02-01","2011-03-01","2011-04-01","2011-05-01","2011-06-01","2011-07-01","2011-08-01","2011-09-01","2011-10-01","2011-11-01","2011-12-01","2012-01-01"]
["Revenue - Enterprise",{"$error":"#N/A"},{"$error":"#N/A"},{"$error":"#N/A"},{"$error":"#N/A"},{"$error":"#N/A"},{"$error":"#N/A"},{"$error":"#N/A"},{"$error":"#N/A"},{"$error":"#N/A"},{"$error":"#N/A"},{"$error":"#N/A"},{"$error":"#N/A"},{"$error":"#N/A"},{"$error":"#N/A"},{"$error":"#N/A"},{"$error":"#N/A"},{"$error":"#N/A"},{"$error":"#N/A"},0,54198,55066,54990.9,290303,203788.51,56652,55837.81,160145,52521.57,88276,60077.97,58202,70340.05,58799,60553,56544,54492,57350.75,52694.05,52903.07,51800.17,52063,52665.04,51840.52]
["Revenue - City",{"$error":"#N/A"},{"$error":"#N/A"},{"$error":"#N/A"},{"$error":"#N/A"},{"$error":"#N/A"},{"$error":"#N/A"},{"$error":"#N/A"},{"$error":"#N/A"},{"$error":"#N/A"},{"$error":"#N/A"},{"$error":"#N/A"},{"$error":"#N/A"},{"$error":"#N/A"},{"$error":"#N/A"},{"$error":"#N/A"},{"$error":"#N/A"},{"$error":"#N/A"},{"$error":"#N/A"},0,28537,77934,77163.75,78790,79501,76828,82577.39,78550,79620,80450.69,79662.009999999995,77155.199999999997,78155.25,79828,76154,79814,70298,76781.16,76781.16,76750.17,75937.19,76396.179999999993,75517.539999999994,77551.86]
["Net Increase/Decrease in Customer Count (Enterprise)",{"$error":"#N/A"},{"$error":"#N/A"},{"$error":"#N/A"},{"$error":"#N/A"},{"$error":"#N/A"},{"$error":"#N/A"},{"$error":"#N/A"},{"$error":"#N/A"},{"$error":"#N/A"},{"$error":"#N/A"},{"$error":"#N/A"},{"$error":"#N/A"},{"$error":"#N/A"},{"$error":"#N/A"},{"$error":"#N/A"},{"$error":"#N/A"},{"$error":"#N/A"},{"$error":"#N/A"},1,0,1,2,4,0,0,0,1,1,1,0,-1,-2,0,0,-1,-1,0,-3,2,-1,3,0,1]
["Net Increase/Decrease in Contract Value (Enterprise)",{"$error":"#N/A"},{"$error":"#N/A"},{"$error":"#N/A"},{"$error":"#N/A"},{"$error":"#N/A"},{"$error":"#N/A"},{"$error":"#N/A"},{"$error":"#N/A"},{"$error":"#N/A"},{"$error":"#N/A"},{"$error":"#N/A"},{"$error":"#N/A"},{"$error":"#N/A"},{"$error":"#N/A"},{"$error":"#N/A"},{"$error":"#N/A"},{"$error":"#N/A"},{"$error":"#N/A"},14108,0,18756,3465,12804,0,33000,1535.4,6041,27844,1059,0,-229,-135,-25,0,-540,-720,0,14795,23367,1344,11929,-13440,18396]
["Enterprise:  Technical Issues Reported",{"$error":"#N/A"},{"$error":"#N/A"},{"$error":"#N/A"},{"$error":"#N/A"},{"$error":"#N/A"},{"$error":"#N/A"},{"$error":"#N/A"},{"$error":"#N/A"},{"$error":"#N/A"},{"$error":"#N/A"},{"$error":"#N/A"},{"$error":"#N/A"},{"$error":"#N/A"},{"$error":"#N/A"},{"$error":"#N/A"},{"$error":"#N/A"},{"$error":"#N/A"},{"$error":"#N/A"},{"$error":"#N/A"},{"$error":"#N/A"},{"$error":"#N/A"},{"$error":"#N/A"},{"$error":"#N/A"},{"$error":"#N/A"},{"$error":"#N/A"},{"$error":"#N/A"},{"$error":"#N/A"},{"$error":"#N/A"},{"$error":"#N/A"},{"$error":"#N/A"},{"$error":"#N/A"},{"$error":"#N/A"},{"$error":"#N/A"},{"$error":"#N/A"},{"$error":"#N/A"},{"$error":"#N/A"},1,0,2,2,0,0,0]
["Enterprise:  Phone Outages Reported",{"$error":"#N/A"},{"$error":"#N/A"},{"$error":"#N/A"},{"$error":"#N/A"},{"$error":"#N/A"},{"$error":"#N/A"},{"$error":"#N/A"},{"$error":"#N/A"},{"$error":"#N/A"},{"$error":"#N/A"},{"$error":"#N/A"},{"$error":"#N/A"},{"$error":"#N/A"},{"$error":"#N/A"},{"$error":"#N/A"},{"$error":"#N/A"},{"$error":"#N/A"},{"$error":"#N/A"},{"$error":"#N/A"},{"$error":"#N/A"},{"$error":"#N/A"},{"$error":"#N/A"},{"$error":"#N/A"},{"$error":"#N/A"},{"$error":"#N/A"},{"$error":"#N/A"},{"$error":"#N/A"},{"$error":"#N/A"},{"$error":"#N/A"},{"$error":"#N/A"},{"$error":"#N/A"},{"$error":"#N/A"},{"$error":"#N/A"},{"$error":"#N/A"},{"$error":"#N/A"},{"$error":"#N/A"},8,3,1,3,0,0,3]
["Enterprise:  Internet Outages Reported",{"$error":"#N/A"},{"$error":"#N/A"},{"$error":"#N/A"},{"$error":"#N/A"},{"$error":"#N/A"},{"$error":"#N/A"},{"$error":"#N/A"},{"$error":"#N/A"},{"$error":"#N/A"},{"$error":"#N/A"},{"$error":"#N/A"},{"$error":"#N/A"},{"$error":"#N/A"},{"$error":"#N/A"},{"$error":"#N/A"},{"$error":"#N/A"},{"$error":"#N/A"},{"$error":"#N/A"},{"$error":"#N/A"},{"$error":"#N/A"},{"$error":"#N/A"},{"$error":"#N/A"},{"$error":"#N/A"},{"$error":"#N/A"},{"$error":"#N/A"},{"$error":"#N/A"},{"$error":"#N/A"},{"$error":"#N/A"},{"$error":"#N/A"},{"$error":"#N/A"},{"$error":"#N/A"},{"$error":"#N/A"},{"$error":"#N/A"},{"$error":"#N/A"},{"$error":"#N/A"},{"$error":"#N/A"},0,0,0,0,0,0,2]
["Enterprise:  Billing Errors Reported",{"$error":"#N/A"},{"$error":"#N/A"},{"$error":"#N/A"},{"$error":"#N/A"},{"$error":"#N/A"},{"$error":"#N/A"},{"$error":"#N/A"},{"$error":"#N/A"},{"$error":"#N/A"},{"$error":"#N/A"},{"$error":"#N/A"},{"$error":"#N/A"},{"$error":"#N/A"},{"$error":"#N/A"},{"$error":"#N/A"},{"$error":"#N/A"},{"$error":"#N/A"},{"$error":"#N/A"},{"$error":"#N/A"},{"$error":"#N/A"},{"$error":"#N/A"},{"$error":"#N/A"},{"$error":"#N/A"},{"$error":"#N/A"},{"$error":"#N/A"},{"$error":"#N/A"},{"$error":"#N/A"},{"$error":"#N/A"},{"$error":"#N/A"},{"$error":"#N/A"},{"$error":"#N/A"},{"$error":"#N/A"},{"$error":"#N/A"},{"$error":"#N/A"},{"$error":"#N/A"},{"$error":"#N/A"},0,0,0,0,0,0,0]
["Service Change Request:  Add Service",{"$error":"#N/A"},{"$error":"#N/A"},{"$error":"#N/A"},{"$error":"#N/A"},{"$error":"#N/A"},{"$error":"#N/A"},{"$error":"#N/A"},{"$error":"#N/A"},{"$error":"#N/A"},{"$error":"#N/A"},{"$error":"#N/A"},{"$error":"#N/A"},{"$error":"#N/A"},{"$error":"#N/A"},{"$error":"#N/A"},{"$error":"#N/A"},{"$error":"#N/A"},{"$error":"#N/A"},{"$error":"#N/A"},{"$error":"#N/A"},{"$error":"#N/A"},{"$error":"#N/A"},{"$error":"#N/A"},{"$error":"#N/A"},{"$error":"#N/A"},{"$error":"#N/A"},{"$error":"#N/A"},{"$error":"#N/A"},{"$error":"#N/A"},{"$error":"#N/A"},{"$error":"#N/A"},{"$error":"#N/A"},{"$error":"#N/A"},{"$error":"#N/A"},{"$error":"#N/A"},{"$error":"#N/A"},0,2,2,0,3,2,2]
["Service Change Request:  Remove Service",{"$error":"#N/A"},{"$error":"#N/A"},{"$error":"#N/A"},{"$error":"#N/A"},{"$error":"#N/A"},{"$error":"#N/A"},{"$error":"#N/A"},{"$error":"#N/A"},{"$error":"#N/A"},{"$error":"#N/A"},{"$error":"#N/A"},{"$error":"#N/A"},{"$error":"#N/A"},{"$error":"#N/A"},{"$error":"#N/A"},{"$error":"#N/A"},{"$error":"#N/A"},{"$error":"#N/A"},{"$error":"#N/A"},{"$error":"#N/A"},{"$error":"#N/A"},{"$error":"#N/A"},{"$error":"#N/A"},{"$error":"#N/A"},{"$error":"#N/A"},{"$error":"#N/A"},{"$error":"#N/A"},{"$error":"#N/A"},{"$error":"#N/A"},{"$error":"#N/A"},{"$error":"#N/A"},{"$error":"#N/A"},{"$error":"#N/A"},{"$error":"#N/A"},{"$error":"#N/A"},{"$error":"#N/A"},1,1,1,1,0,1,1]
["Service Change Request:  Move Service",{"$error":"#N/A"},{"$error":"#N/A"},{"$error":"#N/A"},{"$error":"#N/A"},{"$error":"#N/A"},{"$error":"#N/A"},{"$error":"#N/A"},{"$error":"#N/A"},{"$error":"#N/A"},{"$error":"#N/A"},{"$error":"#N/A"},{"$error":"#N/A"},{"$error":"#N/A"},{"$error":"#N/A"},{"$error":"#N/A"},{"$error":"#N/A"},{"$error":"#N/A"},{"$error":"#N/A"},{"$error":"#N/A"},{"$error":"#N/A"},{"$error":"#N/A"},{"$error":"#N/A"},{"$error":"#N/A"},{"$error":"#N/A"},{"$error":"#N/A"},{"$error":"#N/A"},{"$error":"#N/A"},{"$error":"#N/A"},{"$error":"#N/A"},{"$error":"#N/A"},{"$error":"#N/A"},{"$error":"#N/A"},{"$error":"#N/A"},{"$error":"#N/A"},{"$error":"#N/A"},{"$error":"#N/A"},0,1,0,0,0,0,0]
["Total Support Requests (Enterprise)",{"$error":"#N/A"},{"$error":"#N/A"},{"$error":"#N/A"},{"$error":"#N/A"},{"$error":"#N/A"},{"$error":"#N/A"},{"$error":"#N/A"},{"$error":"#N/A"},{"$error":"#N/A"},{"$error":"#N/A"},{"$error":"#N/A"},{"$error":"#N/A"},{"$error":"#N/A"},{"$error":"#N/A"},{"$error":"#N/A"},{"$error":"#N/A"},{"$error":"#N/A"},{"$error":"#N/A"},{"$error":"#N/A"},{"$error":"#N/A"},{"$error":"#N/A"},{"$error":"#N/A"},{"$error":"#N/A"},{"$error":"#N/A"},{"$error":"#N/A"},{"$error":"#N/A"},{"$error":"#N/A"},{"$error":"#N/A"},{"$error":"#N/A"},{"$error":"#N/A"},{"$error":"#N/A"},{"$error":"#N/A"},{"$error":"#N/A"},{"$error":"#N/A"},{"$error":"#N/A"},{"$error":"#N/A"},10,7,6,6,3,3,8]
["Total Support Requests (City)",{"$error":"#N/A"},{"$error":"#N/A"},{"$error":"#N/A"},{"$error":"#N/A"},{"$error":"#N/A"},{"$error":"#N/A"},{"$error":"#N/A"},{"$error":"#N/A"},{"$error":"#N/A"},{"$error":"#N/A"},{"$error":"#N/A"},{"$error":"#N/A"},{"$error":"#N/A"},{"$error":"#N/A"},{"$error":"#N/A"},{"$error":"#N/A"},{"$error":"#N/A"},{"$error":"#N/A"},98,103,131,90,93,93,123,83,121,206,129,90,89,130,150,131,105,202,164,226,250,236,164,155,203]
["Cell Minutes Consumed (City)",{"$error":"#N/A"},{"$error":"#N/A"},{"$error":"#N/A"},{"$error":"#N/A"},{"$error":"#N/A"},{"$error":"#N/A"},{"$error":"#N/A"},{"$error":"#N/A"},{"$error":"#N/A"},{"$error":"#N/A"},{"$error":"#N/A"},{"$error":"#N/A"},{"$error":"#N/A"},{"$error":"#N/A"},{"$error":"#N/A"},{"$error":"#N/A"},{"$error":"#N/A"},{"$error":"#N/A"},21715,24427,23232,25004,24674,24674,24192,21794,30085,32931,34938,32991,32795,32795,33169,40672,39498,35114,36724,38438,37931,36789,36327,34769,30326]
[]
[]
[]
[]
[]
[]
[]
[]
["HIGHLIGHTS","2008-07-01","2008-08-01","2008-09-01","2008-10-01","2008-11-01","2008-12-01","2009-01-01","2009-02-01","2009-03-01","2009-04-01","2009-05-01","2009-06-01","2009-07-01","2009-08-01","2009-09-01","2009-10-01","2009-11-01","2009-12-01","2010-01-01","2010-02-01","2010-03-01","2010-04-01","2010-05-01","2010-06-01","2010-07-01","2010-08-01","2010-09-01","2010-10-01","2010-11-01","2010-12-01","2011-01-01","2011-02-01","2011-03-01","2011-04-01","2011-05-01","2011-06-01","2011-07-01","2011-08-01","2011-09-01","2011-10-01","2011-11-01","2011-12-01","2012-01-01"]
["Highlight 1",null,null,null,null,null,null,null,null,null,null,null,null,null,null,null,null,null,null,null,null,null,null,null,null,null,null,null,null,null,null,null,null,null,null,null,null,null,"1. In an effort to provide more value to our customer base, Fibercom has released two new service levels for our internet customers in August.  These products provide up to 10 and 15 Mbps of bandwidth speed and in most cases without an increase in the monthly recurring rate.  In order to obtain this fabulous new industry leading service, we are encouraging our customers to renew or extend their existing contracts.  We are happy to report that as customers are made aware of this new offering, they are just as excited as we are \"to get more for their money\". ","1. Fifteen customers renewed contracts and upgraded bandwidth",null,"Added three new customers (two internet and one phone and internet).","One new phone customer/lost one customer","Added one new customer/existing customer added new service"]
["Highlight 2",null,null,null,null,null,null,null,null,null,null,null,null,null,null,null,null,null,null,null,null,null,null,null,null,null,null,null,null,null,null,null,null,null,null,null,null,null,null,null,null,null,"Lost customer due to bank failed","3 customers reported phone lines with no dial tone"]
["Highlight 3",null,null,null,null,null,null,null,null,null,null,null,null,null,null,null,null,null,null,null,null,null,null,null,null,null,null,null,null,null,null,null,null,null,null,null,null,null,null,null,null,null,"NewCustomer added phone service/existing customer added additional phone services","2 customers reported internet down "]
["Highlight 4",null,null,null,null,null,null,null,null,null,null,null,null,null,null,null,null,null,null,null,null,null,null,null,null,null,null,null,null,null,null,null,null,null,null,null,null,null,null,null,null,null,"Disconnected internet for bank failure customer","NewCustomer added phone service/existing customer added additional phone services"]
["Highlight 5",null,null,null,null,null,null,null,null,null,null,null,null,null,null,null,null,null,null,null,null,null,null,null,null,null,null,null,null,null,null,null,null,null,null,null,null,null,null,null,null,null,null,"Existing customer removed 2 lines from his system "]
["Highlight 6"]
["Highlight 7"]
["Highlight 8"]
["Highlights Concaetenation",{"$f":"B28&CHAR(10)&B29&CHAR(10)&B30&CHAR(10)&B31&CHAR(10)&B32&CHAR(10)&B33&CHAR(10)&B34&CHAR(10)&B35","v":"\n\n\n\n\n\n\n"},{"$f":"C28&CHAR(10)&C29&CHAR(10)&C30&CHAR(10)&C31&CHAR(10)&C32&CHAR(10)&C33&CHAR(10)&C34&CHAR(10)&C35","v":"\n\n\n\n\n\n\n"},"\n\n\n\n\n\n\n","\n\n\n\n\n\n\n","\n\n\n\n\n\n\n","\n\n\n\n\n\n\n","\n\n\n\n\n\n\n","\n\n\n\n\n\n\n","\n\n\n\n\n\n\n","\n\n\n\n\n\n\n","\n\n\n\n\n\n\n","\n\n\n\n\n\n\n","\n\n\n\n\n\n\n","\n\n\n\n\n\n\n","\n\n\n\n\n\n\n","\n\n\n\n\n\n\n","\n\n\n\n\n\n\n","\n\n\n\n\n\n\n","\n\n\n\n\n\n\n","\n\n\n\n\n\n\n","\n\n\n\n\n\n\n","\n\n\n\n\n\n\n","\n\n\n\n\n\n\n","\n\n\n\n\n\n\n","\n\n\n\n\n\n\n","\n\n\n\n\n\n\n","\n\n\n\n\n\n\n","\n\n\n\n\n\n\n","\n\n\n\n\n\n\n","\n\n\n\n\n\n\n","\n\n\n\n\n\n\n","\n\n\n\n\n\n\n","\n\n\n\n\n\n\n","\n\n\n\n\n\n\n",{"$f":"AJ28&CHAR(10)&AJ29&CHAR(10)&AJ30&CHAR(10)&AJ31&CHAR(10)&AJ32&CHAR(10)&AJ33&CHAR(10)&AJ34&CHAR(10)&AJ35","v":"\n\n\n\n\n\n\n"},"\n\n\n\n\n\n\n","\n\n\n\n\n\n\n",{"$f":"AM28&CHAR(10)&CHAR(10)&AM29&CHAR(10)&CHAR(10)&AM30&CHAR(10)&CHAR(10)&AM31&CHAR(10)&CHAR(10)&AM32&CHAR(10)&CHAR(10)&AM33&CHAR(10)&CHAR(10)&AM34&CHAR(10)&CHAR(10)&AM35","v":"1. In an effort to provide more value to our customer base, Fibercom has released two new service levels for our internet customers in August.  These products provide up to 10 and 15 Mbps of bandwidth speed and in most cases without an increase in the monthly recurring rate.  In order to obtain this fabulous new industry leading service, we are encouraging our customers to renew or extend their existing contracts.  We are happy to report that as customers are made aware of this new offering, they are just as excited as we are \"to get more for their money\". \n\n\n\n\n\n\n\n\n\n\n\n\n\n"},"1. Fifteen customers renewed contracts and upgraded bandwidth\n\n\n\n\n\n\n\n\n\n\n\n\n\n","\n\n\n\n\n\n\n\n\n\n\n\n\n\n","Added three new customers (two internet and one phone and internet).\n\n\n\n\n\n\n\n\n\n\n\n\n\n","One new phone customer/lost one customer\n\nLost customer due to bank failed\n\nNewCustomer added phone service/existing customer added additional phone services\n\nDisconnected internet for bank failure customer\n\n\n\n\n\n\n\n","Added one new customer/existing customer added new service\n\n3 customers reported phone lines with no dial tone\n\n2 customers reported internet down \n\nNewCustomer added phone service/existing customer added additional phone services\n\nExisting customer removed 2 lines from his system \n\n\n\n\n\n"]
[]
[]
[]
["Bullet Chart Source","Target","What's Better?","Band 1","Band 2","YTD Type","Max Scale","Actual 1","Actual","Actual 3","Projection 1","Projection 2","Projection 3","First Zone 1","First Zone 2","First Zone 3","Second Zone 1","Second Zone 2","Second Zone 3","Previous X 1","Previous X 2","Previous Y 1","Previous Y 2"]
[{"$f":"A5","v":"Revenue - Enterprise"},366635,"More",0.85,1,"Sum",{"$f":"ROUNDUP((ROUNDUP(MAX(B41,SUM(I41,L41)),-LEN(EVEN(MAX(B41,SUM(I41,L41))))+2)/5),-LEN(EVEN(ROUNDUP(MAX(B41,SUM(I41,L41)),-LEN(EVEN(MAX(B41,SUM(I41,L41))))+2)/5))+1)*5","v":400000},0,{"$f":"IF(F41=\"Sum\",SUM(OFFSET(A5,0,YTDBeg,1,YTDWidth)),AVERAGE(OFFSET(A5,0,YTDBeg,1,YTDWidth)))","v":371316.6},0,0,{"$f":"IF(F41=\"Sum\",Projection*(I41/YTDWidth*12-I41),0)","v":0},0,{"$f":"B41*D41","v":311639.75},{"$f":"((I41+L41<=N41)*(N41-(I41+L41)))","v":0},{"$f":"N41","v":311639.75},{"$f":"(E41-D41)*B41","v":54995.250000000007},{"$f":"((I41+L41<=N41+Q41)*((N41+Q41)-(I41+L41+O41)))","v":0},{"$f":"Q41","v":54995.250000000007},{"$f":"IF(F41=\"Sum\",SUM(OFFSET(A5,0,YTDBeg-12,1,YTDWidth)),AVERAGE(OFFSET(A5,0,YTDBeg-12,1,YTDWidth)))","v":531712.35},{"$f":"T41","v":531712.35},1,2]
[{"$f":"A6","v":"Revenue - City"},1275665,"Middle",0.93,1.07,"Sum",{"$f":"ROUNDUP((ROUNDUP(MAX(B42,SUM(I42,L42)),-LEN(EVEN(MAX(B42,SUM(I42,L42))))+2)/5),-LEN(EVEN(ROUNDUP(MAX(B42,SUM(I42,L42)),-LEN(EVEN(MAX(B42,SUM(I42,L42))))+2)/5))+1)*5","v":1500000},0,535715.26,0,0,0,0,1186368.45,{"$f":"((I42+L42<=N42)*(N42-(I42+L42)))","v":650653.18999999994},{"$f":"N42","v":1186368.45},178593.1,{"$f":"((I42+L42<=N42+Q42)*((N42+Q42)-(I42+L42+O42)))","v":178593.10000000009},{"$f":"Q42","v":178593.1},554843.29,{"$f":"T42","v":554843.29},1,2]
["Net Increase/Decrease in Customer Count (Enterprise)",11,"More",0.85,1,"Sum",15,0,2,0,0,0,0,9.35,7.35,9.35,1.6500000000000004,1.6500000000000004,1.6500000000000004,2,2,1,2]
["Net Increase/Decrease in Contract Value (Enterprise)",104733,"More",0.85,1,"Sum",150000,0,56391,0,0,0,0,89023.05,32632.050000000003,89023.05,15709.950000000003,15709.949999999997,15709.950000000003,69250.399999999994,69250.399999999994,1,2]
["Enterprise:  Technical Issues Reported",12,"Less",1,1.1499999999999999,"Sum",15,0,5,0,0,0,0,12,7,12,1.7999999999999989,1.7999999999999989,1.7999999999999989,{"$error":"#N/A"},{"$error":"#N/A"},1,2]
["Enterprise:  Phone Outages Reported",8,"Less",1,1.1499999999999999,"Sum",20,0,18,0,0,0,0,8,0,8,1.1999999999999993,0,1.1999999999999993,{"$error":"#N/A"},{"$error":"#N/A"},1,2]
["Enterprise:  Internet Outages Reported",7,"Less",1,1.1499999999999999,"Sum",10,0,2,0,0,0,0,7,5,7,1.0499999999999994,1.0499999999999989,1.0499999999999994,{"$error":"#N/A"},{"$error":"#N/A"},1,2]
["Enterprise:  Billing Errors Reported",5,"Less",1,1.1499999999999999,"Sum",{"$f":"ROUNDUP((ROUNDUP(MAX(B48,SUM(I48,L48)),-LEN(EVEN(MAX(B48,SUM(I48,L48))))+2)/5),-LEN(EVEN(ROUNDUP(MAX(B48,SUM(I48,L48)),-LEN(EVEN(MAX(B48,SUM(I48,L48))))+2)/5))+1)*5","v":5},0,0,0,0,0,0,{"$f":"B48*D48","v":5},{"$f":"((I48+L48<=N48)*(N48-(I48+L48)))","v":5},{"$f":"N48","v":5},{"$f":"(E48-D48)*B48","v":0.74999999999999956},{"$f":"((I48+L48<=N48+Q48)*((N48+Q48)-(I48+L48+O48)))","v":0.75},{"$f":"Q48","v":0.74999999999999956},{"$error":"#N/A"},{"$f":"T48","v":{"$error":"#N/A"}},1,2]
["Service Change Request:  Add Service",18,"More",0.85,1,"Sum",20,0,11,0,0,0,0,15.299999999999999,4.2999999999999989,15.299999999999999,2.7,2.7000000000000011,2.7,{"$error":"#N/A"},{"$error":"#N/A"},1,2]
["Service Change Request:  Remove Service",12,"Less",1,1.1499999999999999,"Sum",15,0,6,0,0,0,0,12,6,12,1.7999999999999989,1.7999999999999989,1.7999999999999989,{"$error":"#N/A"},{"$error":"#N/A"},1,2]
["Service Change Request:  Move Service",12,"Less",1,1.1499999999999999,"Sum",15,0,1,0,0,0,0,12,11,12,1.7999999999999989,1.7999999999999989,1.7999999999999989,{"$error":"#N/A"},{"$error":"#N/A"},1,2]
["Total Support Requests (Enterprise)",84,"Less",1,1.1499999999999999,"Sum",100,0,43,0,0,0,0,84,41,84,12.599999999999993,12.599999999999994,12.599999999999993,{"$error":"#N/A"},{"$error":"#N/A"},1,2]
["Total Support Requests (City)",1351,"Less",1,1.1499999999999999,"Sum",{"$f":"ROUNDUP((ROUNDUP(MAX(B53,SUM(I53,L53)),-LEN(EVEN(MAX(B53,SUM(I53,L53))))+2)/5),-LEN(EVEN(ROUNDUP(MAX(B53,SUM(I53,L53)),-LEN(EVEN(MAX(B53,SUM(I53,L53))))+2)/5))+1)*5","v":1500},0,{"$f":"IF(F53=\"Sum\",SUM(OFFSET(A17,0,YTDBeg,1,YTDWidth)),AVERAGE(OFFSET(A17,0,YTDBeg,1,YTDWidth)))","v":1398},0,0,{"$f":"IF(F53=\"Sum\",Projection*(I53/YTDWidth*12-I53),0)","v":0},0,{"$f":"B53*D53","v":1351},{"$f":"((I53+L53<=N53)*(N53-(I53+L53)))","v":0},{"$f":"N53","v":1351},{"$f":"(E53-D53)*B53","v":202.64999999999989},{"$f":"((I53+L53<=N53+Q53)*((N53+Q53)-(I53+L53+O53)))","v":155.64999999999986},{"$f":"Q53","v":202.64999999999989},{"$f":"IF(F53=\"Sum\",SUM(OFFSET(A17,0,YTDBeg-12,1,YTDWidth)),AVERAGE(OFFSET(A17,0,YTDBeg-12,1,YTDWidth)))","v":841},{"$f":"T53","v":841},1,2]
["Cell Minutes Consumed (City)",331737,"Less",1,1.1499999999999999,"Sum",{"$f":"ROUNDUP((ROUNDUP(MAX(B54,SUM(I54,L54)),-LEN(EVEN(MAX(B54,SUM(I54,L54))))+2)/5),-LEN(EVEN(ROUNDUP(MAX(B54,SUM(I54,L54)),-LEN(EVEN(MAX(B54,SUM(I54,L54))))+2)/5))+1)*5","v":350000},0,{"$f":"IF(F54=\"Sum\",SUM(OFFSET(A18,0,YTDBeg,1,YTDWidth)),AVERAGE(OFFSET(A18,0,YTDBeg,1,YTDWidth)))","v":251304},0,0,{"$f":"IF(F54=\"Sum\",Projection*(I54/YTDWidth*12-I54),0)","v":0},0,{"$f":"B54*D54","v":331737},{"$f":"((I54+L54<=N54)*(N54-(I54+L54)))","v":80433},{"$f":"N54","v":331737},{"$f":"(E54-D54)*B54","v":49760.549999999974},{"$f":"((I54+L54<=N54+Q54)*((N54+Q54)-(I54+L54+O54)))","v":49760.549999999988},{"$f":"Q54","v":49760.549999999974},{"$f":"IF(F54=\"Sum\",SUM(OFFSET(A18,0,YTDBeg-12,1,YTDWidth)),AVERAGE(OFFSET(A18,0,YTDBeg-12,1,YTDWidth)))","v":209726},{"$f":"T54","v":209726},1,2]
[]
[]
[]
[]
[]
[]
[]
[]
[]
[]
["SPARKLINE SOURCE"]
[null,11,10,9,8,7,6,5,4,3,2,1,0]
["Measure",{"$f":"OFFSET($A4,0,CurrentMonthCount-B$66,1,1)","v":"2011-02-01"},"2011-03-01","2011-04-01","2011-05-01","2011-06-01","2011-07-01","2011-08-01","2011-09-01","2011-10-01","2011-11-01","2011-12-01","2012-01-01"]
[{"$f":"A5","v":"Revenue - Enterprise"},{"$f":"OFFSET($A5,0,CurrentMonthCount-B$66,1,1)","v":70340.05},58799,60553,56544,54492,57350.75,52694.05,52903.07,51800.17,52063,52665.04,51840.52]
[{"$f":"A6","v":"Revenue - City"},{"$f":"OFFSET($A6,0,CurrentMonthCount-B$66,1,1)","v":78155.25},79828,76154,79814,70298,76781.16,76781.16,76750.17,75937.19,76396.179999999993,75517.539999999994,77551.86]
["Net Increase/Decrease in Customer Count (Enterprise)",{"$f":"OFFSET($A7,0,CurrentMonthCount-B$66,1,1)","v":-2},0,0,-1,-1,0,-3,2,-1,3,0,1]
["Net Increase/Decrease in Contract Value (Enterprise)",{"$f":"OFFSET($A8,0,CurrentMonthCount-B$66,1,1)","v":-135},-25,0,-540,-720,0,14795,23367,1344,11929,-13440,18396]
["Enterprise:  Technical Issues Reported",{"$f":"OFFSET($A9,0,CurrentMonthCount-B$66,1,1)","v":{"$error":"#N/A"}},{"$error":"#N/A"},{"$error":"#N/A"},{"$error":"#N/A"},{"$error":"#N/A"},1,0,2,2,0,0,0]
["Enterprise:  Phone Outages Reported",{"$f":"OFFSET($A10,0,CurrentMonthCount-B$66,1,1)","v":{"$error":"#N/A"}},{"$error":"#N/A"},{"$error":"#N/A"},{"$error":"#N/A"},{"$error":"#N/A"},8,3,1,3,0,0,3]
["Enterprise:  Internet Outages Reported",{"$f":"OFFSET($A11,0,CurrentMonthCount-B$66,1,1)","v":{"$error":"#N/A"}},{"$error":"#N/A"},{"$error":"#N/A"},{"$error":"#N/A"},{"$error":"#N/A"},0,0,0,0,0,0,2]
["Enterprise:  Billing Errors Reported",{"$f":"OFFSET($A12,0,CurrentMonthCount-B$66,1,1)","v":{"$error":"#N/A"}},{"$error":"#N/A"},{"$error":"#N/A"},{"$error":"#N/A"},{"$error":"#N/A"},0,0,0,0,0,0,0]
["Service Change Request:  Add Service",{"$f":"OFFSET($A13,0,CurrentMonthCount-B$66,1,1)","v":{"$error":"#N/A"}},{"$error":"#N/A"},{"$error":"#N/A"},{"$error":"#N/A"},{"$error":"#N/A"},0,2,2,0,3,2,2]
["Service Change Request:  Remove Service",{"$f":"OFFSET($A14,0,CurrentMonthCount-B$66,1,1)","v":{"$error":"#N/A"}},{"$error":"#N/A"},{"$error":"#N/A"},{"$error":"#N/A"},{"$error":"#N/A"},1,1,1,1,0,1,1]
["Service Change Request:  Move Service",{"$f":"OFFSET($A15,0,CurrentMonthCount-B$66,1,1)","v":{"$error":"#N/A"}},{"$error":"#N/A"},{"$error":"#N/A"},{"$error":"#N/A"},{"$error":"#N/A"},0,1,0,0,0,0,0]
["Total Support Requests (Enterprise)",{"$f":"OFFSET($A16,0,CurrentMonthCount-B$66,1,1)","v":{"$error":"#N/A"}},{"$error":"#N/A"},{"$error":"#N/A"},{"$error":"#N/A"},{"$error":"#N/A"},10,7,6,6,3,3,8]
["Total Support Requests (City)",{"$f":"OFFSET($A17,0,CurrentMonthCount-B$66,1,1)","v":130},150,131,105,202,164,226,250,236,164,155,203]
["Cell Minutes Consumed (City)",{"$f":"OFFSET($A18,0,CurrentMonthCount-B$66,1,1)","v":32795},33169,40672,39498,35114,36724,38438,37931,36789,36327,34769,30326]
[0,{"$f":"OFFSET($A19,0,CurrentMonthCount-B$66,1,1)","v":0},0,0,0,0,0,0,0,0,0,0,0]
[0,{"$f":"OFFSET($A20,0,CurrentMonthCount-B$66,1,1)","v":0},0,0,0,0,0,0,0,0,0,0,0]
[0,{"$f":"OFFSET($A21,0,CurrentMonthCount-B$66,1,1)","v":0},0,0,0,0,0,0,0,0,0,0,0]
[0,{"$f":"OFFSET($A22,0,CurrentMonthCount-B$66,1,1)","v":0},0,0,0,0,0,0,0,0,0,0,0]
[0,{"$f":"OFFSET($A23,0,CurrentMonthCount-B$66,1,1)","v":0},0,0,0,0,0,0,0,0,0,0,0]
[0,{"$f":"OFFSET($A24,0,CurrentMonthCount-B$66,1,1)","v":0},0,0,0,0,0,0,0,0,0,0,0]
[]
[]
[]
[]
[]
[]
[]
[]
[]
[]
[]
[]
[]
["Cash Drawer Over/Under",-20,0,11]
[null,{"$f":"IF(I43>0,-20,IF(I43<-20,0,-20-I43))","v":-20},{"$f":"I43","v":2},{"$f":"IF(I43<0,11,IF(I43>11,0,11-I43))","v":9}]
[null,-20,0,11]

{"sheet":"Controls","index":31,"n_rows":15,"n_cols":2,"rows_kept":15,"cut":false,"hidden":true,"merged":[]}
[]
[]
["Current Month",{"$f":"OFFSET('Admin Data'!$A$4,0,CurrentMonthCount)","v":"2012-01-01"}]
[]
[]
["Projection",false]
[]
[]
["Current FY","FY2012"]
[]
[]
[]
[]
["Detail Controls"]
["History",{"$f":"IF(BackForward<CurrentMonthCount,IF(BackForward<1,1,BackForward),CurrentMonthCount)","v":24}]

{"sheet":"Measure Descriptions","index":32,"n_rows":307,"n_cols":6,"rows_kept":307,"cut":false,"hidden":true,"merged":[]}
[]
["Measure Descriptions"]
[]
["Average Number of Receptacles Collected per Route-hour",{"$f":"INDEX(A8:F307,MATCH(A4,A8:A307,0),2)","v":"This measure description is currently unavailable.  We are working to include this data as soon as possible."},{"$f":"INDEX(A8:F307,MATCH(A4,A8:A307,0),3)","v":"Unavailable"},{"$f":"INDEX(A8:F307,MATCH(A4,A8:A307,0),4)","v":95.285714285714292},{"$f":"INDEX(A8:F307,MATCH(A4,A8:A307,0),5)","v":99},{"$f":"INDEX(A8:F3075,MATCH(A4,A8:A307,0),6)","v":"or More"}]
[]
[]
["Measure","Description","Factors","FYTD","Goal","Preference"]
[{"$f":"'Admin Data'!A41","v":"Citizen Request Tracker Cases"},"The Citizen Request Tracker (CRT) allows citizens to report issues or request services through the City's website, providing citizens with improved access to the City's local government services.  The City believes that increased use of the CRT results in greater staff awarness of issues faced in the community, and it's use by citizens is encouraged.","NA",{"$f":"'Admin Data'!I41","v":19},{"$f":"'Admin Data'!B41","v":60},{"$f":"IF('Admin Data'!C41=\"More\",\"or More\",IF('Admin Data'!C41=\"Less\",\"or Less\",\"\"))","v":"or More"}]
[{"$f":"'Admin Data'!A42","v":"Quarterly Newsletters Published"},"The Quarterly Newsletter is published four times per year and is used to provide residents with information about the current happenings within the city.","NA",{"$f":"'Admin Data'!I42","v":3},{"$f":"'Admin Data'!B42","v":4},{"$f":"IF('Admin Data'!C42=\"More\",\"or More\",IF('Admin Data'!C42=\"Less\",\"or Less\",\"\"))","v":""}]
[{"$f":"'Admin Data'!A43","v":"Public Performance Reports Issued"},"The City of Cartersville is dedicated to the principles of transparency and accountability.  In an effort to promote and demonstrate these values, the City has begun issuing monthly \"Public Performance Reports\" which contain information about the performance of the various departments within the City's local government.","NA",{"$f":"'Admin Data'!I43","v":0},{"$f":"'Admin Data'!B43","v":12},{"$f":"IF('Admin Data'!C43=\"More\",\"or More\",IF('Admin Data'!C43=\"Less\",\"or Less\",\"\"))","v":""}]
[{"$f":"'Admin Data'!A44","v":"Emergency Overtime Hours Worked By All Departments"},"Emergency overtime includes overtime hours that are worked in response to unplanned/emergency events.  An example of such an unplanned event would be a severe storm which causes damage to electrical lines.  Note:  every few months there are three pay periods, instead of two, resulting in occasional spikes in hours which is to be expected.","Severe weather, infrastructure malfunctions (e.x. broken water main), essential staff calling in sick.",{"$f":"'Admin Data'!I44","v":192},{"$f":"'Admin Data'!B44","v":3800},{"$f":"IF('Admin Data'!C44=\"More\",\"or More\",IF('Admin Data'!C44=\"Less\",\"or Less\",\"\"))","v":"or Less"}]
[{"$f":"'Admin Data'!A45","v":"Planned Overtime Hours Worked By All Departments"},"Planned overtime includes overtime hours that are worked in response to planned activities which occur outside of regularly scheduled hours.  An example would be a water department crew working on infrastructure at a time of day that would limit traffic disruption.  Note:  every few months there are three pay periods, instead of two, resulting in occasional spikes in hours which is to be expected.","Planned work requiring additional hours by staff.",{"$f":"'Admin Data'!I45","v":3511},{"$f":"'Admin Data'!B45","v":5200},{"$f":"IF('Admin Data'!C45=\"More\",\"or More\",IF('Admin Data'!C45=\"Less\",\"or Less\",\"\"))","v":"or Less"}]
[{"$f":"'Admin Data'!A46","v":"On-call Hours Worked By All Departments"},"On-call hours are paid to staff members who are required to be available in case of an unplanned/emergency event.  Note:  every few months there are three pay periods, instead of two, resulting in occasional spikes in hours which is to be expected.","NA",{"$f":"'Admin Data'!I46","v":2034.25},{"$f":"'Admin Data'!B46","v":3900},{"$f":"IF('Admin Data'!C46=\"More\",\"or More\",IF('Admin Data'!C46=\"Less\",\"or Less\",\"\"))","v":"or Less"}]
[{"$f":"'Admin Data'!A47","v":"Sick Leave Hours Used By All Departments"},"Sick leave hours include hours missed by employees due to illness or, in some cases, family illnesses.  Note:  every few months there are three pay periods, instead of two, resulting in occasional spikes in hours which is to be expected.","Employee wellness, seasonal illnesses.",{"$f":"'Admin Data'!I47","v":12500.529999999999},{"$f":"'Admin Data'!B47","v":16680},{"$f":"IF('Admin Data'!C47=\"More\",\"or More\",IF('Admin Data'!C47=\"Less\",\"or Less\",\"\"))","v":"or Less"}]
[{"$f":"'Admin Data'!A48","v":0},null,null,{"$f":"'Admin Data'!I48","v":0},{"$f":"'Admin Data'!B48","v":0},{"$f":"IF('Admin Data'!C48=\"More\",\"or More\",IF('Admin Data'!C48=\"Less\",\"or Less\",\"\"))","v":""}]
[{"$f":"'Admin Data'!A49","v":0},null,null,{"$f":"'Admin Data'!I49","v":0},{"$f":"'Admin Data'!B49","v":0},{"$f":"IF('Admin Data'!C49=\"More\",\"or More\",IF('Admin Data'!C49=\"Less\",\"or Less\",\"\"))","v":""}]
[{"$f":"'Admin Data'!A50","v":0},null,null,{"$f":"'Admin Data'!I50","v":0},{"$f":"'Admin Data'!B50","v":0},{"$f":"IF('Admin Data'!C50=\"More\",\"or More\",IF('Admin Data'!C50=\"Less\",\"or Less\",\"\"))","v":""}]
[{"$f":"'Admin Data'!A51","v":0},null,null,{"$f":"'Admin Data'!I51","v":0},{"$f":"'Admin Data'!B51","v":0},{"$f":"IF('Admin Data'!C51=\"More\",\"or More\",IF('Admin Data'!C51=\"Less\",\"or Less\",\"\"))","v":""}]
[{"$f":"'Admin Data'!A52","v":0},null,null,{"$f":"'Admin Data'!I52","v":0},{"$f":"'Admin Data'!B52","v":0},{"$f":"IF('Admin Data'!C52=\"More\",\"or More\",IF('Admin Data'!C52=\"Less\",\"or Less\",\"\"))","v":""}]
[{"$f":"'Admin Data'!A53","v":0},null,null,{"$f":"'Admin Data'!I53","v":0},{"$f":"'Admin Data'!B53","v":0},{"$f":"IF('Admin Data'!C53=\"More\",\"or More\",IF('Admin Data'!C53=\"Less\",\"or Less\",\"\"))","v":""}]
[{"$f":"'Admin Data'!A54","v":0},null,null,{"$f":"'Admin Data'!I54","v":0},{"$f":"'Admin Data'!B54","v":0},{"$f":"IF('Admin Data'!C54=\"More\",\"or More\",IF('Admin Data'!C54=\"Less\",\"or Less\",\"\"))","v":""}]
[{"$f":"'Admin Data'!A55","v":0},null,null,{"$f":"'Admin Data'!I55","v":0},{"$f":"'Admin Data'!B55","v":0},{"$f":"IF('Admin Data'!C55=\"More\",\"or More\",IF('Admin Data'!C55=\"Less\",\"or Less\",\"\"))","v":""}]
[{"$f":"'Admin Data'!A56","v":0},null,null,{"$f":"'Admin Data'!I56","v":0},{"$f":"'Admin Data'!B56","v":0},{"$f":"IF('Admin Data'!C56=\"More\",\"or More\",IF('Admin Data'!C56=\"Less\",\"or Less\",\"\"))","v":""}]
[{"$f":"'Admin Data'!A57","v":0},null,null,{"$f":"'Admin Data'!I57","v":0},{"$f":"'Admin Data'!B57","v":0},{"$f":"IF('Admin Data'!C57=\"More\",\"or More\",IF('Admin Data'!C57=\"Less\",\"or Less\",\"\"))","v":""}]
[{"$f":"'Admin Data'!A58","v":0},null,null,{"$f":"'Admin Data'!I58","v":0},{"$f":"'Admin Data'!B58","v":0},{"$f":"IF('Admin Data'!C58=\"More\",\"or More\",IF('Admin Data'!C58=\"Less\",\"or Less\",\"\"))","v":""}]
[{"$f":"'Admin Data'!A59","v":0},null,null,{"$f":"'Admin Data'!I59","v":0},{"$f":"'Admin Data'!B59","v":0},{"$f":"IF('Admin Data'!C59=\"More\",\"or More\",IF('Admin Data'!C59=\"Less\",\"or Less\",\"\"))","v":""}]
[{"$f":"'Admin Data'!A60","v":0},null,null,{"$f":"'Admin Data'!I60","v":0},{"$f":"'Admin Data'!B60","v":0},{"$f":"IF('Admin Data'!C60=\"More\",\"or More\",IF('Admin Data'!C60=\"Less\",\"or Less\",\"\"))","v":""}]
[{"$f":"'Finance Data'!A41","v":"Meters Read - Electric"},"The number of electric meters read by the meter reading staff.","NA",{"$f":"'Finance Data'!I41","v":59235},{"$f":"'Finance Data'!B41","v":105000},{"$f":"IF('Finance Data'!C41=\"More\",\"or More\",IF('Finance Data'!C41=\"Less\",\"or Less\",\"\"))","v":""}]
[{"$f":"'Finance Data'!A42","v":"Meters Read - Gas"},"The number of gas meters read by the meter reading staff.","NA",{"$f":"'Finance Data'!I42","v":77335},{"$f":"'Finance Data'!B42","v":128500},{"$f":"IF('Finance Data'!C42=\"More\",\"or More\",IF('Finance Data'!C42=\"Less\",\"or Less\",\"\"))","v":""}]
[{"$f":"'Finance Data'!A43","v":"Meters Read - Water & Sewer"},"The number of water meters read by the meter reading staff.","NA",{"$f":"'Finance Data'!I43","v":77213},{"$f":"'Finance Data'!B43","v":131500},{"$f":"IF('Finance Data'!C43=\"More\",\"or More\",IF('Finance Data'!C43=\"Less\",\"or Less\",\"\"))","v":""}]
[{"$f":"'Finance Data'!A44","v":"Service Disconnections"},"The number of service disconnections completed by the meter reading staff.","NA",{"$f":"'Finance Data'!I44","v":2134},{"$f":"'Finance Data'!B44","v":5100},{"$f":"IF('Finance Data'!C44=\"More\",\"or More\",IF('Finance Data'!C44=\"Less\",\"or Less\",\"\"))","v":"or Less"}]
[{"$f":"'Finance Data'!A45","v":"Service Connections"},"The number of service connections completed by the meter reading staff.","NA",{"$f":"'Finance Data'!I45","v":3479},{"$f":"'Finance Data'!B45","v":5000},{"$f":"IF('Finance Data'!C45=\"More\",\"or More\",IF('Finance Data'!C45=\"Less\",\"or Less\",\"\"))","v":"or More"}]
[{"$f":"'Finance Data'!A46","v":"Bills Generated"},"The number of bills generated by the data processing staff.","NA",{"$f":"'Finance Data'!I46","v":106788},{"$f":"'Finance Data'!B46","v":183000},{"$f":"IF('Finance Data'!C46=\"More\",\"or More\",IF('Finance Data'!C46=\"Less\",\"or Less\",\"\"))","v":""}]
[{"$f":"'Finance Data'!A47","v":"Accounts Payable Invoices Processed"},"The number of accounts payable invoices processed by the accounting staff.  This includes the payment of invoices from vendors and the posting of transactions to the general ledger.","Number of invoices received.",{"$f":"'Finance Data'!I47","v":4521},{"$f":"'Finance Data'!B47","v":11500},{"$f":"IF('Finance Data'!C47=\"More\",\"or More\",IF('Finance Data'!C47=\"Less\",\"or Less\",\"\"))","v":""}]
[{"$f":"'Finance Data'!A48","v":"Manual Journal Entries"},"This measure description is currently unavailable.  We are working to include this data as soon as possible.","Unavailable",{"$f":"'Finance Data'!I48","v":445},{"$f":"'Finance Data'!B48","v":1110},{"$f":"IF('Finance Data'!C48=\"More\",\"or More\",IF('Finance Data'!C48=\"Less\",\"or Less\",\"\"))","v":"or Less"}]
[{"$f":"'Finance Data'!A49","v":0},null,null,{"$f":"'Finance Data'!I49","v":0},{"$f":"'Finance Data'!B49","v":0},{"$f":"IF('Finance Data'!C49=\"More\",\"or More\",IF('Finance Data'!C49=\"Less\",\"or Less\",\"\"))","v":""}]
[{"$f":"'Finance Data'!A50","v":0},null,null,{"$f":"'Finance Data'!I50","v":0},{"$f":"'Finance Data'!B50","v":0},{"$f":"IF('Finance Data'!C50=\"More\",\"or More\",IF('Finance Data'!C50=\"Less\",\"or Less\",\"\"))","v":""}]
[{"$f":"'Finance Data'!A51","v":0},null,null,{"$f":"'Finance Data'!I51","v":0},{"$f":"'Finance Data'!B51","v":0},{"$f":"IF('Finance Data'!C51=\"More\",\"or More\",IF('Finance Data'!C51=\"Less\",\"or Less\",\"\"))","v":""}]
[{"$f":"'Finance Data'!A52","v":0},null,null,{"$f":"'Finance Data'!I52","v":0},{"$f":"'Finance Data'!B52","v":0},{"$f":"IF('Finance Data'!C52=\"More\",\"or More\",IF('Finance Data'!C52=\"Less\",\"or Less\",\"\"))","v":""}]
[{"$f":"'Finance Data'!A53","v":0},null,null,{"$f":"'Finance Data'!I53","v":0},{"$f":"'Finance Data'!B53","v":0},{"$f":"IF('Finance Data'!C53=\"More\",\"or More\",IF('Finance Data'!C53=\"Less\",\"or Less\",\"\"))","v":""}]
[{"$f":"'Finance Data'!A54","v":0},null,null,{"$f":"'Finance Data'!I54","v":0},{"$f":"'Finance Data'!B54","v":0},{"$f":"IF('Finance Data'!C54=\"More\",\"or More\",IF('Finance Data'!C54=\"Less\",\"or Less\",\"\"))","v":""}]
[{"$f":"'Finance Data'!A55","v":0},null,null,{"$f":"'Finance Data'!I55","v":0},{"$f":"'Finance Data'!B55","v":0},{"$f":"IF('Finance Data'!C55=\"More\",\"or More\",IF('Finance Data'!C55=\"Less\",\"or Less\",\"\"))","v":""}]
[{"$f":"'Finance Data'!A56","v":0},null,null,{"$f":"'Finance Data'!I56","v":0},{"$f":"'Finance Data'!B56","v":0},{"$f":"IF('Finance Data'!C56=\"More\",\"or More\",IF('Finance Data'!C56=\"Less\",\"or Less\",\"\"))","v":""}]
[{"$f":"'Finance Data'!A57","v":0},null,null,{"$f":"'Finance Data'!I57","v":0},{"$f":"'Finance Data'!B57","v":0},{"$f":"IF('Finance Data'!C57=\"More\",\"or More\",IF('Finance Data'!C57=\"Less\",\"or Less\",\"\"))","v":""}]
[{"$f":"'Finance Data'!A58","v":0},null,null,{"$f":"'Finance Data'!I58","v":0},{"$f":"'Finance Data'!B58","v":0},{"$f":"IF('Finance Data'!C58=\"More\",\"or More\",IF('Finance Data'!C58=\"Less\",\"or Less\",\"\"))","v":""}]
[{"$f":"'Finance Data'!A59","v":0},null,null,{"$f":"'Finance Data'!I59","v":0},{"$f":"'Finance Data'!B59","v":0},{"$f":"IF('Finance Data'!C59=\"More\",\"or More\",IF('Finance Data'!C59=\"Less\",\"or Less\",\"\"))","v":""}]
[{"$f":"'Finance Data'!A60","v":0},null,null,{"$f":"'Finance Data'!I60","v":0},{"$f":"'Finance Data'!B60","v":0},{"$f":"IF('Finance Data'!C60=\"More\",\"or More\",IF('Finance Data'!C60=\"Less\",\"or Less\",\"\"))","v":""}]
[{"$f":"'CustServ Data'!A41","v":"Complaints Against Customer Service Reps"},"The number of complaints against customer service reps.  The Customer Service department strives to offer customers excellent customer service in a friendly manner.",null,{"$f":"'CustServ Data'!I41","v":7},{"$f":"'CustServ Data'!B41","v":10},{"$f":"IF('CustServ Data'!C41=\"More\",\"or More\",IF('CustServ Data'!C41=\"Less\",\"or Less\",\"\"))","v":"or Less"}]
[{"$f":"'CustServ Data'!A42","v":"Pro-Corp Calls (after hours) - Talk Time in Minutes"},"The City uses Pro-Corp to handle after hour calls, or calls during business hours when local lines are all in use.  This ensures that callers are able to handle transactions when city staff is unavailable.",null,{"$f":"'CustServ Data'!I42","v":11272},{"$f":"'CustServ Data'!B42","v":20000},{"$f":"IF('CustServ Data'!C42=\"More\",\"or More\",IF('CustServ Data'!C42=\"Less\",\"or Less\",\"\"))","v":"or Less"}]
[{"$f":"'CustServ Data'!A43","v":"Payments - Walk-in and Drive-thru"},"This measure description is currently unavailable.  We are working to include this data as soon as possible.","Unavailable",{"$f":"'CustServ Data'!I43","v":51382},{"$f":"'CustServ Data'!B43","v":80000},{"$f":"IF('CustServ Data'!C43=\"More\",\"or More\",IF('CustServ Data'!C43=\"Less\",\"or Less\",\"\"))","v":"or Less"}]
[{"$f":"'CustServ Data'!A44","v":"Payments - Webpay"},"This measure description is currently unavailable.  We are working to include this data as soon as possible.","Unavailable",{"$f":"'CustServ Data'!I44","v":14375},{"$f":"'CustServ Data'!B44","v":23000},{"$f":"IF('CustServ Data'!C44=\"More\",\"or More\",IF('CustServ Data'!C44=\"Less\",\"or Less\",\"\"))","v":"or More"}]
[{"$f":"'CustServ Data'!A45","v":"Payments - Bank Bill Pay"},"This measure description is currently unavailable.  We are working to include this data as soon as possible.","Unavailable",{"$f":"'CustServ Data'!I45","v":9136},{"$f":"'CustServ Data'!B45","v":16000},{"$f":"IF('CustServ Data'!C45=\"More\",\"or More\",IF('CustServ Data'!C45=\"Less\",\"or Less\",\"\"))","v":"or More"}]
[{"$f":"'CustServ Data'!A46","v":"Payments - Drop Box (after hours)"},"This measure description is currently unavailable.  We are working to include this data as soon as possible.","Unavailable",{"$f":"'CustServ Data'!I46","v":7388},{"$f":"'CustServ Data'!B46","v":35000},{"$f":"IF('CustServ Data'!C46=\"More\",\"or More\",IF('CustServ Data'!C46=\"Less\",\"or Less\",\"\"))","v":"or More"}]
[{"$f":"'CustServ Data'!A47","v":"Payments - Mail"},"This measure description is currently unavailable.  We are working to include this data as soon as possible.","Unavailable",{"$f":"'CustServ Data'!I47","v":25900},{"$f":"'CustServ Data'!B47","v":25000},{"$f":"IF('CustServ Data'!C47=\"More\",\"or More\",IF('CustServ Data'!C47=\"Less\",\"or Less\",\"\"))","v":"or More"}]
[{"$f":"'CustServ Data'!A48","v":"Payments - Wired Cash"},"This measure description is currently unavailable.  We are working to include this data as soon as possible.","Unavailable",{"$f":"'CustServ Data'!I48","v":222},{"$f":"'CustServ Data'!B48","v":200},{"$f":"IF('CustServ Data'!C48=\"More\",\"or More\",IF('CustServ Data'!C48=\"Less\",\"or Less\",\"\"))","v":"or Less"}]
[{"$f":"'CustServ Data'!A49","v":"Payments - Auto Bank Draft"},"This measure description is currently unavailable.  We are working to include this data as soon as possible.","Unavailable",{"$f":"'CustServ Data'!I49","v":5795},{"$f":"'CustServ Data'!B49","v":12000},{"$f":"IF('CustServ Data'!C49=\"More\",\"or More\",IF('CustServ Data'!C49=\"Less\",\"or Less\",\"\"))","v":"or More"}]
[{"$f":"'CustServ Data'!A50","v":"Billing Errors"},"This measure description is currently unavailable.  We are working to include this data as soon as possible.","Unavailable",{"$f":"'CustServ Data'!I50","v":46},{"$f":"'CustServ Data'!B50","v":40},{"$f":"IF('CustServ Data'!C50=\"More\",\"or More\",IF('CustServ Data'!C50=\"Less\",\"or Less\",\"\"))","v":"or Less"}]
[{"$f":"'CustServ Data'!A51","v":"Cash Drawer Over-Under"},"This measure description is currently unavailable.  We are working to include this data as soon as possible.","Unavailable",{"$f":"'CustServ Data'!I51","v":-20.96},{"$f":"'CustServ Data'!B51","v":-100},{"$f":"IF('CustServ Data'!C51=\"More\",\"or More\",IF('CustServ Data'!C51=\"Less\",\"or Less\",\"\"))","v":""}]
[{"$f":"'CustServ Data'!A52","v":"Service Disconnections (Transactions)"},"This measure description is currently unavailable.  We are working to include this data as soon as possible.","Unavailable",{"$f":"'CustServ Data'!I52","v":2134},{"$f":"'CustServ Data'!B52","v":5000},{"$f":"IF('CustServ Data'!C52=\"More\",\"or More\",IF('CustServ Data'!C52=\"Less\",\"or Less\",\"\"))","v":"or Less"}]
[{"$f":"'CustServ Data'!A53","v":"Service Connections (Transactions)"},"This measure description is currently unavailable.  We are working to include this data as soon as possible.","Unavailable",{"$f":"'CustServ Data'!I53","v":3479},{"$f":"'CustServ Data'!B53","v":5200},{"$f":"IF('CustServ Data'!C53=\"More\",\"or More\",IF('CustServ Data'!C53=\"Less\",\"or Less\",\"\"))","v":"or More"}]
[{"$f":"'CustServ Data'!A54","v":0},"This measure description is currently unavailable.  We are working to include this data as soon as possible.","Unavailable",{"$f":"'CustServ Data'!I54","v":0},{"$f":"'CustServ Data'!B54","v":0},{"$f":"IF('CustServ Data'!C54=\"More\",\"or More\",IF('CustServ Data'!C54=\"Less\",\"or Less\",\"\"))","v":""}]
[{"$f":"'CustServ Data'!A55","v":0},"This measure description is currently unavailable.  We are working to include this data as soon as possible.","Unavailable",{"$f":"'CustServ Data'!I55","v":0},{"$f":"'CustServ Data'!B55","v":0},{"$f":"IF('CustServ Data'!C55=\"More\",\"or More\",IF('CustServ Data'!C55=\"Less\",\"or Less\",\"\"))","v":""}]
[{"$f":"'CustServ Data'!A56","v":0},"This measure description is currently unavailable.  We are working to include this data as soon as possible.","Unavailable",{"$f":"'CustServ Data'!I56","v":0},{"$f":"'CustServ Data'!B56","v":0},{"$f":"IF('CustServ Data'!C56=\"More\",\"or More\",IF('CustServ Data'!C56=\"Less\",\"or Less\",\"\"))","v":""}]
[{"$f":"'CustServ Data'!A57","v":0},"This measure description is currently unavailable.  We are working to include this data as soon as possible.","Unavailable",{"$f":"'CustServ Data'!I57","v":0},{"$f":"'CustServ Data'!B57","v":0},{"$f":"IF('CustServ Data'!C57=\"More\",\"or More\",IF('CustServ Data'!C57=\"Less\",\"or Less\",\"\"))","v":""}]
[{"$f":"'CustServ Data'!A58","v":0},"This measure description is currently unavailable.  We are working to include this data as soon as possible.","Unavailable",{"$f":"'CustServ Data'!I58","v":0},{"$f":"'CustServ Data'!B58","v":0},{"$f":"IF('CustServ Data'!C58=\"More\",\"or More\",IF('CustServ Data'!C58=\"Less\",\"or Less\",\"\"))","v":""}]
[{"$f":"'CustServ Data'!A59","v":0},"This measure description is currently unavailable.  We are working to include this data as soon as possible.","Unavailable",{"$f":"'CustServ Data'!I59","v":0},{"$f":"'CustServ Data'!B59","v":0},{"$f":"IF('CustServ Data'!C59=\"More\",\"or More\",IF('CustServ Data'!C59=\"Less\",\"or Less\",\"\"))","v":""}]
[{"$f":"'CustServ Data'!A60","v":0},"This measure description is currently unavailable.  We are working to include this data as soon as possible.","Unavailable",{"$f":"'CustServ Data'!I60","v":0},{"$f":"'CustServ Data'!B60","v":0},{"$f":"IF('CustServ Data'!C60=\"More\",\"or More\",IF('CustServ Data'!C60=\"Less\",\"or Less\",\"\"))","v":""}]
[{"$f":"'Police Data'!A41","v":"UCR Part I Violent Crimes"},"This measure description is currently unavailable.  We are working to include this data as soon as possible.","Unavailable",{"$f":"'Police Data'!I41","v":38},{"$f":"'Police Data'!B41","v":42},{"$f":"IF('Police Data'!C41=\"More\",\"or More\",IF('Police Data'!C41=\"Less\",\"or Less\",\"\"))","v":"or Less"}]
[{"$f":"'Police Data'!A42","v":"UCR Part I Property Crimes"},"This measure description is currently unavailable.  We are working to include this data as soon as possible.","Unavailable",{"$f":"'Police Data'!I42","v":688},{"$f":"'Police Data'!B42","v":964},{"$f":"IF('Police Data'!C42=\"More\",\"or More\",IF('Police Data'!C42=\"Less\",\"or Less\",\"\"))","v":"or Less"}]
[{"$f":"'Police Data'!A43","v":"UCR Part II Drug Offenses"},"This measure description is currently unavailable.  We are working to include this data as soon as possible.","Unavailable",{"$f":"'Police Data'!I43","v":103},{"$f":"'Police Data'!B43","v":158},{"$f":"IF('Police Data'!C43=\"More\",\"or More\",IF('Police Data'!C43=\"Less\",\"or Less\",\"\"))","v":"or Less"}]
[{"$f":"'Police Data'!A44","v":"Crime Clearance Rate"},"This measure description is currently unavailable.  We are working to include this data as soon as possible.","Unavailable",{"$f":"'Police Data'!I44","v":0.5962142857142857},{"$f":"'Police Data'!B44","v":0.48},{"$f":"IF('Police Data'!C44=\"More\",\"or More\",IF('Police Data'!C44=\"Less\",\"or Less\",\"\"))","v":"or More"}]
[{"$f":"'Police Data'!A45","v":"Incidents Requiring a Response (Police)"},"This measure description is currently unavailable.  We are working to include this data as soon as possible.","Unavailable",{"$f":"'Police Data'!I45","v":18045},{"$f":"'Police Data'!B45","v":28315},{"$f":"IF('Police Data'!C45=\"More\",\"or More\",IF('Police Data'!C45=\"Less\",\"or Less\",\"\"))","v":"or Less"}]
[{"$f":"'Police Data'!A46","v":"Bartow 911 Response Time (call entry to dispatch - top priority calls, secs)"},"This measure description is currently unavailable.  We are working to include this data as soon as possible.","Unavailable",{"$f":"'Police Data'!I46","v":186.42857142857142},{"$f":"'Police Data'!B46","v":191},{"$f":"IF('Police Data'!C46=\"More\",\"or More\",IF('Police Data'!C46=\"Less\",\"or Less\",\"\"))","v":"or Less"}]
[{"$f":"'Police Data'!A47","v":"CPD Response Time (dispatch to arrival - top priority calls, secs)"},"This measure description is currently unavailable.  We are working to include this data as soon as possible.","Unavailable",{"$f":"'Police Data'!I47","v":269.42857142857144},{"$f":"'Police Data'!B47","v":258},{"$f":"IF('Police Data'!C47=\"More\",\"or More\",IF('Police Data'!C47=\"Less\",\"or Less\",\"\"))","v":"or Less"}]
[{"$f":"'Police Data'!A48","v":"% of Top Priority Calls with Response Time < 5 Minutes (CPD dispatch to arrival)"},"This measure description is currently unavailable.  We are working to include this data as soon as possible.","Unavailable",{"$f":"'Police Data'!I48","v":0.71714285714285708},{"$f":"'Police Data'!B48","v":0.65500000000000003},{"$f":"IF('Police Data'!C48=\"More\",\"or More\",IF('Police Data'!C48=\"Less\",\"or Less\",\"\"))","v":"or More"}]
[{"$f":"'Police Data'!A49","v":"Traffic Citations Issued (Excluding DUI)"},"This measure description is currently unavailable.  We are working to include this data as soon as possible.","Unavailable",{"$f":"'Police Data'!I49","v":2303},{"$f":"'Police Data'!B49","v":5412},{"$f":"IF('Police Data'!C49=\"More\",\"or More\",IF('Police Data'!C49=\"Less\",\"or Less\",\"\"))","v":""}]
[{"$f":"'Police Data'!A50","v":"Traffic Accidents Reported"},"This measure description is currently unavailable.  We are working to include this data as soon as possible.","Unavailable",{"$f":"'Police Data'!I50","v":779},{"$f":"'Police Data'!B50","v":1438},{"$f":"IF('Police Data'!C50=\"More\",\"or More\",IF('Police Data'!C50=\"Less\",\"or Less\",\"\"))","v":"or Less"}]
[{"$f":"'Police Data'!A51","v":"DUI Arrests"},"This measure description is currently unavailable.  We are working to include this data as soon as possible.","Unavailable",{"$f":"'Police Data'!I51","v":56},{"$f":"'Police Data'!B51","v":96},{"$f":"IF('Police Data'!C51=\"More\",\"or More\",IF('Police Data'!C51=\"Less\",\"or Less\",\"\"))","v":"or Less"}]
[{"$f":"'Police Data'!A52","v":"Staff Injuries (Police)"},"This measure description is currently unavailable.  We are working to include this data as soon as possible.","Unavailable",{"$f":"'Police Data'!I52","v":4},{"$f":"'Police Data'!B52","v":8},{"$f":"IF('Police Data'!C52=\"More\",\"or More\",IF('Police Data'!C52=\"Less\",\"or Less\",\"\"))","v":"or Less"}]
[{"$f":"'Police Data'!A53","v":"Training Hours Received (Police)"},"This measure description is currently unavailable.  We are working to include this data as soon as possible.","Unavailable",{"$f":"'Police Data'!I53","v":1794},{"$f":"'Police Data'!B53","v":4183},{"$f":"IF('Police Data'!C53=\"More\",\"or More\",IF('Police Data'!C53=\"Less\",\"or Less\",\"\"))","v":""}]
[{"$f":"'Police Data'!A54","v":"Officer Complaints"},"This measure description is currently unavailable.  We are working to include this data as soon as possible.","Unavailable",{"$f":"'Police Data'!I54","v":20},{"$f":"'Police Data'!B54","v":55},{"$f":"IF('Police Data'!C54=\"More\",\"or More\",IF('Police Data'!C54=\"Less\",\"or Less\",\"\"))","v":"or Less"}]
[{"$f":"'Police Data'!A55","v":"Officer Complaints Sustained"},"This measure description is currently unavailable.  We are working to include this data as soon as possible.","Unavailable",{"$f":"'Police Data'!I55","v":1},{"$f":"'Police Data'!B55","v":9},{"$f":"IF('Police Data'!C55=\"More\",\"or More\",IF('Police Data'!C55=\"Less\",\"or Less\",\"\"))","v":"or Less"}]
[{"$f":"'Police Data'!A56","v":0},"This measure description is currently unavailable.  We are working to include this data as soon as possible.","Unavailable",{"$f":"'Police Data'!I56","v":0},{"$f":"'Police Data'!B56","v":0},{"$f":"IF('Police Data'!C56=\"More\",\"or More\",IF('Police Data'!C56=\"Less\",\"or Less\",\"\"))","v":""}]
[{"$f":"'Police Data'!A57","v":0},"This measure description is currently unavailable.  We are working to include this data as soon as possible.","Unavailable",{"$f":"'Police Data'!I57","v":0},{"$f":"'Police Data'!B57","v":0},{"$f":"IF('Police Data'!C57=\"More\",\"or More\",IF('Police Data'!C57=\"Less\",\"or Less\",\"\"))","v":""}]
[{"$f":"'Police Data'!A58","v":0},"This measure description is currently unavailable.  We are working to include this data as soon as possible.","Unavailable",{"$f":"'Police Data'!I58","v":0},{"$f":"'Police Data'!B58","v":0},{"$f":"IF('Police Data'!C58=\"More\",\"or More\",IF('Police Data'!C58=\"Less\",\"or Less\",\"\"))","v":""}]
[{"$f":"'Police Data'!A59","v":0},"This measure description is currently unavailable.  We are working to include this data as soon as possible.","Unavailable",{"$f":"'Police Data'!I59","v":0},{"$f":"'Police Data'!B59","v":0},{"$f":"IF('Police Data'!C59=\"More\",\"or More\",IF('Police Data'!C59=\"Less\",\"or Less\",\"\"))","v":""}]
[{"$f":"'Police Data'!A60","v":0},"This measure description is currently unavailable.  We are working to include this data as soon as possible.","Unavailable",{"$f":"'Police Data'!I60","v":0},{"$f":"'Police Data'!B60","v":0},{"$f":"IF('Police Data'!C60=\"More\",\"or More\",IF('Police Data'!C60=\"Less\",\"or Less\",\"\"))","v":""}]
[{"$f":"'Fire Data'!A41","v":"Inspections Performed"},"This measure description is currently unavailable.  We are working to include this data as soon as possible.","Unavailable",{"$f":"'Fire Data'!I41","v":1243},{"$f":"'Fire Data'!B41","v":2367},{"$f":"IF('Fire Data'!C41=\"More\",\"or More\",IF('Fire Data'!C41=\"Less\",\"or Less\",\"\"))","v":"or More"}]
[{"$f":"'Fire Data'!A42","v":"Reinspections/Follow-ups"},"This measure description is currently unavailable.  We are working to include this data as soon as possible.","Unavailable",{"$f":"'Fire Data'!I42","v":6},{"$f":"'Fire Data'!B42","v":100},{"$f":"IF('Fire Data'!C42=\"More\",\"or More\",IF('Fire Data'!C42=\"Less\",\"or Less\",\"\"))","v":"or Less"}]
[{"$f":"'Fire Data'!A43","v":"Public Education Sessions Provided"},"This measure description is currently unavailable.  We are working to include this data as soon as possible.","Unavailable",{"$f":"'Fire Data'!I43","v":29},{"$f":"'Fire Data'!B43","v":50},{"$f":"IF('Fire Data'!C43=\"More\",\"or More\",IF('Fire Data'!C43=\"Less\",\"or Less\",\"\"))","v":"or More"}]
[{"$f":"'Fire Data'!A44","v":"Public Education Citizen Contacts"},"This measure description is currently unavailable.  We are working to include this data as soon as possible.","Unavailable",{"$f":"'Fire Data'!I44","v":2941},{"$f":"'Fire Data'!B44","v":3361},{"$f":"IF('Fire Data'!C44=\"More\",\"or More\",IF('Fire Data'!C44=\"Less\",\"or Less\",\"\"))","v":"or More"}]
[{"$f":"'Fire Data'!A45","v":"Smoke Detectors Provided to Public"},"This measure description is currently unavailable.  We are working to include this data as soon as possible.","Unavailable",{"$f":"'Fire Data'!I45","v":35},{"$f":"'Fire Data'!B45","v":108},{"$f":"IF('Fire Data'!C45=\"More\",\"or More\",IF('Fire Data'!C45=\"Less\",\"or Less\",\"\"))","v":"or More"}]
[{"$f":"'Fire Data'!A46","v":"Incidents Requiring a Response"},"This measure description is currently unavailable.  We are working to include this data as soon as possible.","Unavailable",{"$f":"'Fire Data'!I46","v":1821},{"$f":"'Fire Data'!B46","v":3067},{"$f":"IF('Fire Data'!C46=\"More\",\"or More\",IF('Fire Data'!C46=\"Less\",\"or Less\",\"\"))","v":"or Less"}]
[{"$f":"'Fire Data'!A47","v":"Structure Fire Incidents"},"This measure description is currently unavailable.  We are working to include this data as soon as possible.","Unavailable",{"$f":"'Fire Data'!I47","v":20},{"$f":"'Fire Data'!B47","v":44},{"$f":"IF('Fire Data'!C47=\"More\",\"or More\",IF('Fire Data'!C47=\"Less\",\"or Less\",\"\"))","v":"or Less"}]
[{"$f":"'Fire Data'!A48","v":"Fire Incidents (Non-structure)"},"This measure description is currently unavailable.  We are working to include this data as soon as possible.","Unavailable",{"$f":"'Fire Data'!I48","v":72},{"$f":"'Fire Data'!B48","v":104},{"$f":"IF('Fire Data'!C48=\"More\",\"or More\",IF('Fire Data'!C48=\"Less\",\"or Less\",\"\"))","v":"or Less"}]
[{"$f":"'Fire Data'!A49","v":"Medical Assists"},"This measure description is currently unavailable.  We are working to include this data as soon as possible.","Unavailable",{"$f":"'Fire Data'!I49","v":1212},{"$f":"'Fire Data'!B49","v":2048},{"$f":"IF('Fire Data'!C49=\"More\",\"or More\",IF('Fire Data'!C49=\"Less\",\"or Less\",\"\"))","v":"or Less"}]
[{"$f":"'Fire Data'!A50","v":"False Alarms"},"This measure description is currently unavailable.  We are working to include this data as soon as possible.","Unavailable",{"$f":"'Fire Data'!I50","v":101},{"$f":"'Fire Data'!B50","v":197},{"$f":"IF('Fire Data'!C50=\"More\",\"or More\",IF('Fire Data'!C50=\"Less\",\"or Less\",\"\"))","v":"or Less"}]
[{"$f":"'Fire Data'!A51","v":"Other Calls"},"This measure description is currently unavailable.  We are working to include this data as soon as possible.","Unavailable",{"$f":"'Fire Data'!I51","v":416},{"$f":"'Fire Data'!B51","v":669},{"$f":"IF('Fire Data'!C51=\"More\",\"or More\",IF('Fire Data'!C51=\"Less\",\"or Less\",\"\"))","v":"or Less"}]
[{"$f":"'Fire Data'!A52","v":"Mutual/Automatic Aid Given"},"This measure description is currently unavailable.  We are working to include this data as soon as possible.","Unavailable",{"$f":"'Fire Data'!I52","v":137},{"$f":"'Fire Data'!B52","v":288},{"$f":"IF('Fire Data'!C52=\"More\",\"or More\",IF('Fire Data'!C52=\"Less\",\"or Less\",\"\"))","v":"or Less"}]
[{"$f":"'Fire Data'!A53","v":"Mutual/Automatic Aid Received"},"This measure description is currently unavailable.  We are working to include this data as soon as possible.","Unavailable",{"$f":"'Fire Data'!I53","v":18},{"$f":"'Fire Data'!B53","v":38},{"$f":"IF('Fire Data'!C53=\"More\",\"or More\",IF('Fire Data'!C53=\"Less\",\"or Less\",\"\"))","v":"or Less"}]
[{"$f":"'Fire Data'!A54","v":"Bartow 911 Response Time (PSAP, Top Priority Calls)"},"This measure description is currently unavailable.  We are working to include this data as soon as possible.","Unavailable",{"$f":"'Fire Data'!I54","v":152.71428571428572},{"$f":"'Fire Data'!B54","v":120},{"$f":"IF('Fire Data'!C54=\"More\",\"or More\",IF('Fire Data'!C54=\"Less\",\"or Less\",\"\"))","v":"or Less"}]
[{"$f":"'Fire Data'!A55","v":"Turnout Time (Top Priority Calls)"},"This measure description is currently unavailable.  We are working to include this data as soon as possible.","Unavailable",{"$f":"'Fire Data'!I55","v":63.428571428571431},{"$f":"'Fire Data'!B55","v":60},{"$f":"IF('Fire Data'!C55=\"More\",\"or More\",IF('Fire Data'!C55=\"Less\",\"or Less\",\"\"))","v":"or Less"}]
[{"$f":"'Fire Data'!A56","v":"Response Time (Top Priority Calls)"},"This measure description is currently unavailable.  We are working to include this data as soon as possible.","Unavailable",{"$f":"'Fire Data'!I56","v":225.85714285714286},{"$f":"'Fire Data'!B56","v":300},{"$f":"IF('Fire Data'!C56=\"More\",\"or More\",IF('Fire Data'!C56=\"Less\",\"or Less\",\"\"))","v":"or Less"}]
[{"$f":"'Fire Data'!A57","v":"% of Top Priority Calls with Response Time of < 5 Mins"},"This measure description is currently unavailable.  We are working to include this data as soon as possible.","Unavailable",{"$f":"'Fire Data'!I57","v":0.68100000000000005},{"$f":"'Fire Data'!B57","v":0.68},{"$f":"IF('Fire Data'!C57=\"More\",\"or More\",IF('Fire Data'!C57=\"Less\",\"or Less\",\"\"))","v":"or More"}]
[{"$f":"'Fire Data'!A58","v":"Structure Fires Contained to Room of Origin"},"This measure description is currently unavailable.  We are working to include this data as soon as possible.","Unavailable",{"$f":"'Fire Data'!I58","v":16},{"$f":"'Fire Data'!B58","v":18},{"$f":"IF('Fire Data'!C58=\"More\",\"or More\",IF('Fire Data'!C58=\"Less\",\"or Less\",\"\"))","v":"or More"}]
[{"$f":"'Fire Data'!A59","v":"Dollar Amount of Fire Damage Loss"},"This measure description is currently unavailable.  We are working to include this data as soon as possible.","Unavailable",{"$f":"'Fire Data'!I59","v":275470},{"$f":"'Fire Data'!B59","v":449639},{"$f":"IF('Fire Data'!C59=\"More\",\"or More\",IF('Fire Data'!C59=\"Less\",\"or Less\",\"\"))","v":"or Less"}]
[{"$f":"'Fire Data'!A60","v":"Dollar Amount of Fire Damage Saved"},"This measure description is currently unavailable.  We are working to include this data as soon as possible.","Unavailable",{"$f":"'Fire Data'!I60","v":4650552},{"$f":"'Fire Data'!B60","v":5580900},{"$f":"IF('Fire Data'!C60=\"More\",\"or More\",IF('Fire Data'!C60=\"Less\",\"or Less\",\"\"))","v":"or More"}]
[{"$f":"'Public Data'!A41","v":"Road Maintenance Work Orders Completed"},"This measure description is currently unavailable.  We are working to include this data as soon as possible.","Unavailable",{"$f":"'Public Data'!I41","v":304},{"$f":"'Public Data'!B41","v":413},{"$f":"IF('Public Data'!C41=\"More\",\"or More\",IF('Public Data'!C41=\"Less\",\"or Less\",\"\"))","v":""}]
[{"$f":"'Public Data'!A42","v":"Pot Holes Repaired"},"This measure description is currently unavailable.  We are working to include this data as soon as possible.","Unavailable",{"$f":"'Public Data'!I42","v":68},{"$f":"'Public Data'!B42","v":193},{"$f":"IF('Public Data'!C42=\"More\",\"or More\",IF('Public Data'!C42=\"Less\",\"or Less\",\"\"))","v":""}]
[{"$f":"'Public Data'!A43","v":"Tons of Asphalt Spread"},"This measure description is currently unavailable.  We are working to include this data as soon as possible.","Unavailable",{"$f":"'Public Data'!I43","v":107},{"$f":"'Public Data'!B43","v":295},{"$f":"IF('Public Data'!C43=\"More\",\"or More\",IF('Public Data'!C43=\"Less\",\"or Less\",\"\"))","v":""}]
[{"$f":"'Public Data'!A44","v":"Utility Cuts Repaired"},"This measure description is currently unavailable.  We are working to include this data as soon as possible.","Unavailable",{"$f":"'Public Data'!I44","v":186},{"$f":"'Public Data'!B44","v":383},{"$f":"IF('Public Data'!C44=\"More\",\"or More\",IF('Public Data'!C44=\"Less\",\"or Less\",\"\"))","v":""}]
[{"$f":"'Public Data'!A45","v":"Square Feet of Sidewalk Repaired"},"This measure description is currently unavailable.  We are working to include this data as soon as possible.","Unavailable",{"$f":"'Public Data'!I45","v":15635},{"$f":"'Public Data'!B45","v":7278},{"$f":"IF('Public Data'!C45=\"More\",\"or More\",IF('Public Data'!C45=\"Less\",\"or Less\",\"\"))","v":"or More"}]
[{"$f":"'Public Data'!A46","v":"Roadside Mowing (Lane Miles)"},"This measure description is currently unavailable.  We are working to include this data as soon as possible.","Unavailable",{"$f":"'Public Data'!I46","v":458.9},{"$f":"'Public Data'!B46","v":1747},{"$f":"IF('Public Data'!C46=\"More\",\"or More\",IF('Public Data'!C46=\"Less\",\"or Less\",\"\"))","v":""}]
[{"$f":"'Public Data'!A47","v":"Complaints Received About Road Conditions"},"This measure description is currently unavailable.  We are working to include this data as soon as possible.","Unavailable",{"$f":"'Public Data'!I47","v":63},{"$f":"'Public Data'!B47","v":94},{"$f":"IF('Public Data'!C47=\"More\",\"or More\",IF('Public Data'!C47=\"Less\",\"or Less\",\"\"))","v":"or Less"}]
[{"$f":"'Public Data'!A48","v":"Tree Trimming Work Orders Completed"},"This measure description is currently unavailable.  We are working to include this data as soon as possible.","Unavailable",{"$f":"'Public Data'!I48","v":79},{"$f":"'Public Data'!B48","v":142},{"$f":"IF('Public Data'!C48=\"More\",\"or More\",IF('Public Data'!C48=\"Less\",\"or Less\",\"\"))","v":""}]
[{"$f":"'Public Data'!A49","v":"Landscaping Work Orders Completed"},"This measure description is currently unavailable.  We are working to include this data as soon as possible.","Unavailable",{"$f":"'Public Data'!I49","v":20},{"$f":"'Public Data'!B49","v":42},{"$f":"IF('Public Data'!C49=\"More\",\"or More\",IF('Public Data'!C49=\"Less\",\"or Less\",\"\"))","v":""}]
[{"$f":"'Public Data'!A50","v":"Facility Maintenance Work Orders Completed"},"This measure description is currently unavailable.  We are working to include this data as soon as possible.","Unavailable",{"$f":"'Public Data'!I50","v":40},{"$f":"'Public Data'!B50","v":102},{"$f":"IF('Public Data'!C50=\"More\",\"or More\",IF('Public Data'!C50=\"Less\",\"or Less\",\"\"))","v":"or Less"}]
[{"$f":"'Public Data'!A51","v":"Staff Injuries (Public Works)"},"This measure description is currently unavailable.  We are working to include this data as soon as possible.","Unavailable",{"$f":"'Public Data'!I51","v":1},{"$f":"'Public Data'!B51","v":0},{"$f":"IF('Public Data'!C51=\"More\",\"or More\",IF('Public Data'!C51=\"Less\",\"or Less\",\"\"))","v":"or Less"}]
[{"$f":"'Public Data'!A52","v":0},"This measure description is currently unavailable.  We are working to include this data as soon as possible.","Unavailable",{"$f":"'Public Data'!I52","v":0},{"$f":"'Public Data'!B52","v":0},{"$f":"IF('Public Data'!C52=\"More\",\"or More\",IF('Public Data'!C52=\"Less\",\"or Less\",\"\"))","v":""}]
[{"$f":"'Public Data'!A53","v":0},"This measure description is currently unavailable.  We are working to include this data as soon as possible.","Unavailable",{"$f":"'Public Data'!I53","v":0},{"$f":"'Public Data'!B53","v":0},{"$f":"IF('Public Data'!C53=\"More\",\"or More\",IF('Public Data'!C53=\"Less\",\"or Less\",\"\"))","v":""}]
[{"$f":"'Public Data'!A54","v":0},"This measure description is currently unavailable.  We are working to include this data as soon as possible.","Unavailable",{"$f":"'Public Data'!I54","v":0},{"$f":"'Public Data'!B54","v":0},{"$f":"IF('Public Data'!C54=\"More\",\"or More\",IF('Public Data'!C54=\"Less\",\"or Less\",\"\"))","v":""}]
[{"$f":"'Public Data'!A55","v":0},"This measure description is currently unavailable.  We are working to include this data as soon as possible.","Unavailable",{"$f":"'Public Data'!I55","v":0},{"$f":"'Public Data'!B55","v":0},{"$f":"IF('Public Data'!C55=\"More\",\"or More\",IF('Public Data'!C55=\"Less\",\"or Less\",\"\"))","v":""}]
[{"$f":"'Public Data'!A56","v":0},"This measure description is currently unavailable.  We are working to include this data as soon as possible.","Unavailable",{"$f":"'Public Data'!I56","v":0},{"$f":"'Public Data'!B56","v":0},{"$f":"IF('Public Data'!C56=\"More\",\"or More\",IF('Public Data'!C56=\"Less\",\"or Less\",\"\"))","v":""}]
[{"$f":"'Public Data'!A57","v":0},"This measure description is currently unavailable.  We are working to include this data as soon as possible.","Unavailable",{"$f":"'Public Data'!I57","v":0},{"$f":"'Public Data'!B57","v":0},{"$f":"IF('Public Data'!C57=\"More\",\"or More\",IF('Public Data'!C57=\"Less\",\"or Less\",\"\"))","v":""}]
[{"$f":"'Public Data'!A58","v":0},"This measure description is currently unavailable.  We are working to include this data as soon as possible.","Unavailable",{"$f":"'Public Data'!I58","v":0},{"$f":"'Public Data'!B58","v":0},{"$f":"IF('Public Data'!C58=\"More\",\"or More\",IF('Public Data'!C58=\"Less\",\"or Less\",\"\"))","v":""}]
[{"$f":"'Public Data'!A59","v":0},"This measure description is currently unavailable.  We are working to include this data as soon as possible.","Unavailable",{"$f":"'Public Data'!I59","v":0},{"$f":"'Public Data'!B59","v":0},{"$f":"IF('Public Data'!C59=\"More\",\"or More\",IF('Public Data'!C59=\"Less\",\"or Less\",\"\"))","v":""}]
[{"$f":"'Public Data'!A60","v":0},"This measure description is currently unavailable.  We are working to include this data as soon as possible.","Unavailable",{"$f":"'Public Data'!I60","v":0},{"$f":"'Public Data'!B60","v":0},{"$f":"IF('Public Data'!C60=\"More\",\"or More\",IF('Public Data'!C60=\"Less\",\"or Less\",\"\"))","v":""}]
[{"$f":"'Parks Data'!A41","v":"Special Events Conducted/ Hosted/Sponsored"},"This measure description is currently unavailable.  We are working to include this data as soon as possible.","Unavailable",{"$f":"'Parks Data'!I41","v":27},{"$f":"'Parks Data'!B41","v":78},{"$f":"IF('Parks Data'!C41=\"More\",\"or More\",IF('Parks Data'!C41=\"Less\",\"or Less\",\"\"))","v":"or More"}]
[{"$f":"'Parks Data'!A42","v":"Grants Awarded"},"This measure description is currently unavailable.  We are working to include this data as soon as possible.","Unavailable",{"$f":"'Parks Data'!I42","v":0},{"$f":"'Parks Data'!B42","v":2},{"$f":"IF('Parks Data'!C42=\"More\",\"or More\",IF('Parks Data'!C42=\"Less\",\"or Less\",\"\"))","v":"or More"}]
[{"$f":"'Parks Data'!A43","v":"Facility Rentals"},"This measure description is currently unavailable.  We are working to include this data as soon as possible.","Unavailable",{"$f":"'Parks Data'!I43","v":262},{"$f":"'Parks Data'!B43","v":1150},{"$f":"IF('Parks Data'!C43=\"More\",\"or More\",IF('Parks Data'!C43=\"Less\",\"or Less\",\"\"))","v":"or More"}]
[{"$f":"'Parks Data'!A44","v":"Registered Program Participants (Youth)"},"This measure description is currently unavailable.  We are working to include this data as soon as possible.","Unavailable",{"$f":"'Parks Data'!I44","v":1237},{"$f":"'Parks Data'!B44","v":2700},{"$f":"IF('Parks Data'!C44=\"More\",\"or More\",IF('Parks Data'!C44=\"Less\",\"or Less\",\"\"))","v":"or More"}]
[{"$f":"'Parks Data'!A45","v":"Registered Program Participants (Adult)"},"This measure description is currently unavailable.  We are working to include this data as soon as possible.","Unavailable",{"$f":"'Parks Data'!I45","v":731},{"$f":"'Parks Data'!B45","v":1200},{"$f":"IF('Parks Data'!C45=\"More\",\"or More\",IF('Parks Data'!C45=\"Less\",\"or Less\",\"\"))","v":"or More"}]
[{"$f":"'Parks Data'!A46","v":"Hours of Program Participation (Youth)"},"This measure description is currently unavailable.  We are working to include this data as soon as possible.","Unavailable",{"$f":"'Parks Data'!I46","v":67009},{"$f":"'Parks Data'!B46","v":135500},{"$f":"IF('Parks Data'!C46=\"More\",\"or More\",IF('Parks Data'!C46=\"Less\",\"or Less\",\"\"))","v":"or More"}]
[{"$f":"'Parks Data'!A47","v":"Hours of Program Participation (Adult)"},"This measure description is currently unavailable.  We are working to include this data as soon as possible.","Unavailable",{"$f":"'Parks Data'!I47","v":17895.5},{"$f":"'Parks Data'!B47","v":26500},{"$f":"IF('Parks Data'!C47=\"More\",\"or More\",IF('Parks Data'!C47=\"Less\",\"or Less\",\"\"))","v":"or More"}]
[{"$f":"'Parks Data'!A48","v":"Volunteer Hours Worked"},"This measure description is currently unavailable.  We are working to include this data as soon as possible.","Unavailable",{"$f":"'Parks Data'!I48","v":5995.25},{"$f":"'Parks Data'!B48","v":11500},{"$f":"IF('Parks Data'!C48=\"More\",\"or More\",IF('Parks Data'!C48=\"Less\",\"or Less\",\"\"))","v":"or More"}]
[{"$f":"'Parks Data'!A49","v":"Staff Injuries (Parks)"},"This measure description is currently unavailable.  We are working to include this data as soon as possible.","Unavailable",{"$f":"'Parks Data'!I49","v":0},{"$f":"'Parks Data'!B49","v":0},{"$f":"IF('Parks Data'!C49=\"More\",\"or More\",IF('Parks Data'!C49=\"Less\",\"or Less\",\"\"))","v":"or Less"}]
[{"$f":"'Parks Data'!A50","v":"Crimes Reported on Park Property"},"This measure description is currently unavailable.  We are working to include this data as soon as possible.","Unavailable",{"$f":"'Parks Data'!I50","v":12},{"$f":"'Parks Data'!B50","v":10},{"$f":"IF('Parks Data'!C50=\"More\",\"or More\",IF('Parks Data'!C50=\"Less\",\"or Less\",\"\"))","v":"or Less"}]
[{"$f":"'Parks Data'!A51","v":"Documented Participant Injuries"},"This measure description is currently unavailable.  We are working to include this data as soon as possible.","Unavailable",{"$f":"'Parks Data'!I51","v":37},{"$f":"'Parks Data'!B51","v":10},{"$f":"IF('Parks Data'!C51=\"More\",\"or More\",IF('Parks Data'!C51=\"Less\",\"or Less\",\"\"))","v":"or Less"}]
[{"$f":"'Parks Data'!A52","v":0},"This measure description is currently unavailable.  We are working to include this data as soon as possible.","Unavailable",{"$f":"'Parks Data'!I52","v":0},{"$f":"'Parks Data'!B52","v":0},{"$f":"IF('Parks Data'!C52=\"More\",\"or More\",IF('Parks Data'!C52=\"Less\",\"or Less\",\"\"))","v":""}]
[{"$f":"'Parks Data'!A53","v":0},"This measure description is currently unavailable.  We are working to include this data as soon as possible.","Unavailable",{"$f":"'Parks Data'!I53","v":0},{"$f":"'Parks Data'!B53","v":0},{"$f":"IF('Parks Data'!C53=\"More\",\"or More\",IF('Parks Data'!C53=\"Less\",\"or Less\",\"\"))","v":""}]
[{"$f":"'Parks Data'!A54","v":0},"This measure description is currently unavailable.  We are working to include this data as soon as possible.","Unavailable",{"$f":"'Parks Data'!I54","v":0},{"$f":"'Parks Data'!B54","v":0},{"$f":"IF('Parks Data'!C54=\"More\",\"or More\",IF('Parks Data'!C54=\"Less\",\"or Less\",\"\"))","v":""}]
[{"$f":"'Parks Data'!A55","v":0},"This measure description is currently unavailable.  We are working to include this data as soon as possible.","Unavailable",{"$f":"'Parks Data'!I55","v":0},{"$f":"'Parks Data'!B55","v":0},{"$f":"IF('Parks Data'!C55=\"More\",\"or More\",IF('Parks Data'!C55=\"Less\",\"or Less\",\"\"))","v":""}]
[{"$f":"'Parks Data'!A56","v":0},"This measure description is currently unavailable.  We are working to include this data as soon as possible.","Unavailable",{"$f":"'Parks Data'!I56","v":0},{"$f":"'Parks Data'!B56","v":0},{"$f":"IF('Parks Data'!C56=\"More\",\"or More\",IF('Parks Data'!C56=\"Less\",\"or Less\",\"\"))","v":""}]
[{"$f":"'Parks Data'!A57","v":0},"This measure description is currently unavailable.  We are working to include this data as soon as possible.","Unavailable",{"$f":"'Parks Data'!I57","v":0},{"$f":"'Parks Data'!B57","v":0},{"$f":"IF('Parks Data'!C57=\"More\",\"or More\",IF('Parks Data'!C57=\"Less\",\"or Less\",\"\"))","v":""}]
[{"$f":"'Parks Data'!A58","v":0},"This measure description is currently unavailable.  We are working to include this data as soon as possible.","Unavailable",{"$f":"'Parks Data'!I58","v":0},{"$f":"'Parks Data'!B58","v":0},{"$f":"IF('Parks Data'!C58=\"More\",\"or More\",IF('Parks Data'!C58=\"Less\",\"or Less\",\"\"))","v":""}]
[{"$f":"'Parks Data'!A59","v":0},"This measure description is currently unavailable.  We are working to include this data as soon as possible.","Unavailable",{"$f":"'Parks Data'!I59","v":0},{"$f":"'Parks Data'!B59","v":0},{"$f":"IF('Parks Data'!C59=\"More\",\"or More\",IF('Parks Data'!C59=\"Less\",\"or Less\",\"\"))","v":""}]
[{"$f":"'Parks Data'!A60","v":0},"This measure description is currently unavailable.  We are working to include this data as soon as possible.","Unavailable",{"$f":"'Parks Data'!I60","v":0},{"$f":"'Parks Data'!B60","v":0},{"$f":"IF('Parks Data'!C60=\"More\",\"or More\",IF('Parks Data'!C60=\"Less\",\"or Less\",\"\"))","v":""}]
[{"$f":"'Planning Data'!A41","v":"Residential Building Permits Issued"},"This measure description is currently unavailable.  We are working to include this data as soon as possible.","Unavailable",{"$f":"'Planning Data'!I41","v":2},{"$f":"'Planning Data'!B41","v":10},{"$f":"IF('Planning Data'!C41=\"More\",\"or More\",IF('Planning Data'!C41=\"Less\",\"or Less\",\"\"))","v":"or More"}]
[{"$f":"'Planning Data'!A42","v":"Remodel Permits Issued"},"This measure description is currently unavailable.  We are working to include this data as soon as possible.","Unavailable",{"$f":"'Planning Data'!I42","v":31},{"$f":"'Planning Data'!B42","v":51},{"$f":"IF('Planning Data'!C42=\"More\",\"or More\",IF('Planning Data'!C42=\"Less\",\"or Less\",\"\"))","v":"or More"}]
[{"$f":"'Planning Data'!A43","v":"Non-residential Building Permits Issued"},"This measure description is currently unavailable.  We are working to include this data as soon as possible.","Unavailable",{"$f":"'Planning Data'!I43","v":25},{"$f":"'Planning Data'!B43","v":14},{"$f":"IF('Planning Data'!C43=\"More\",\"or More\",IF('Planning Data'!C43=\"Less\",\"or Less\",\"\"))","v":"or More"}]
[{"$f":"'Planning Data'!A44","v":"Land Disturbance Permits Issued"},"This measure description is currently unavailable.  We are working to include this data as soon as possible.","Unavailable",{"$f":"'Planning Data'!I44","v":2},{"$f":"'Planning Data'!B44","v":5},{"$f":"IF('Planning Data'!C44=\"More\",\"or More\",IF('Planning Data'!C44=\"Less\",\"or Less\",\"\"))","v":"or More"}]
[{"$f":"'Planning Data'!A45","v":"Sign Permits Issued"},"This measure description is currently unavailable.  We are working to include this data as soon as possible.","Unavailable",{"$f":"'Planning Data'!I45","v":51},{"$f":"'Planning Data'!B45","v":100},{"$f":"IF('Planning Data'!C45=\"More\",\"or More\",IF('Planning Data'!C45=\"Less\",\"or Less\",\"\"))","v":"or More"}]
[{"$f":"'Planning Data'!A46","v":"Inspections Performed"},"This measure description is currently unavailable.  We are working to include this data as soon as possible.","Unavailable",{"$f":"'Planning Data'!I46","v":180},{"$f":"'Planning Data'!B46","v":428},{"$f":"IF('Planning Data'!C46=\"More\",\"or More\",IF('Planning Data'!C46=\"Less\",\"or Less\",\"\"))","v":"or More"}]
[{"$f":"'Planning Data'!A47","v":"Annexation Cases"},"This measure description is currently unavailable.  We are working to include this data as soon as possible.","Unavailable",{"$f":"'Planning Data'!I47","v":2},{"$f":"'Planning Data'!B47","v":4},{"$f":"IF('Planning Data'!C47=\"More\",\"or More\",IF('Planning Data'!C47=\"Less\",\"or Less\",\"\"))","v":"or More"}]
[{"$f":"'Planning Data'!A48","v":"Zoning Cases"},"This measure description is currently unavailable.  We are working to include this data as soon as possible.","Unavailable",{"$f":"'Planning Data'!I48","v":2},{"$f":"'Planning Data'!B48","v":8},{"$f":"IF('Planning Data'!C48=\"More\",\"or More\",IF('Planning Data'!C48=\"Less\",\"or Less\",\"\"))","v":"or More"}]
[{"$f":"'Planning Data'!A49","v":"Historic Preservation Cases"},"This measure description is currently unavailable.  We are working to include this data as soon as possible.","Unavailable",{"$f":"'Planning Data'!I49","v":7},{"$f":"'Planning Data'!B49","v":10},{"$f":"IF('Planning Data'!C49=\"More\",\"or More\",IF('Planning Data'!C49=\"Less\",\"or Less\",\"\"))","v":"or More"}]
[{"$f":"'Planning Data'!A50","v":"Variance Cases"},"This measure description is currently unavailable.  We are working to include this data as soon as possible.","Unavailable",{"$f":"'Planning Data'!I50","v":11},{"$f":"'Planning Data'!B50","v":16},{"$f":"IF('Planning Data'!C50=\"More\",\"or More\",IF('Planning Data'!C50=\"Less\",\"or Less\",\"\"))","v":"or More"}]
[{"$f":"'Planning Data'!A51","v":"Plan Reviews"},"This measure description is currently unavailable.  We are working to include this data as soon as possible.","Unavailable",{"$f":"'Planning Data'!I51","v":20},{"$f":"'Planning Data'!B51","v":45},{"$f":"IF('Planning Data'!C51=\"More\",\"or More\",IF('Planning Data'!C51=\"Less\",\"or Less\",\"\"))","v":"or More"}]
[{"$f":"'Planning Data'!A52","v":"New Business Licenses Issued"},"This measure description is currently unavailable.  We are working to include this data as soon as possible.","Unavailable",{"$f":"'Planning Data'!I52","v":127},{"$f":"'Planning Data'!B52","v":232},{"$f":"IF('Planning Data'!C52=\"More\",\"or More\",IF('Planning Data'!C52=\"Less\",\"or Less\",\"\"))","v":"or More"}]
[{"$f":"'Planning Data'!A53","v":"Business Licenses Renewed"},"This measure description is currently unavailable.  We are working to include this data as soon as possible.","Unavailable",{"$f":"'Planning Data'!I53","v":740},{"$f":"'Planning Data'!B53","v":1562},{"$f":"IF('Planning Data'!C53=\"More\",\"or More\",IF('Planning Data'!C53=\"Less\",\"or Less\",\"\"))","v":"or More"}]
[{"$f":"'Planning Data'!A54","v":"New Alcohol Licenses Issued"},"This measure description is currently unavailable.  We are working to include this data as soon as possible.","Unavailable",{"$f":"'Planning Data'!I54","v":7},{"$f":"'Planning Data'!B54","v":30},{"$f":"IF('Planning Data'!C54=\"More\",\"or More\",IF('Planning Data'!C54=\"Less\",\"or Less\",\"\"))","v":"or More"}]
[{"$f":"'Planning Data'!A55","v":"Alcohol Licenses Renewed"},"This measure description is currently unavailable.  We are working to include this data as soon as possible.","Unavailable",{"$f":"'Planning Data'!I55","v":161},{"$f":"'Planning Data'!B55","v":76},{"$f":"IF('Planning Data'!C55=\"More\",\"or More\",IF('Planning Data'!C55=\"Less\",\"or Less\",\"\"))","v":"or More"}]
[{"$f":"'Planning Data'!A56","v":"Code Violations"},"This measure description is currently unavailable.  We are working to include this data as soon as possible.","Unavailable",{"$f":"'Planning Data'!I56","v":424},{"$f":"'Planning Data'!B56","v":750},{"$f":"IF('Planning Data'!C56=\"More\",\"or More\",IF('Planning Data'!C56=\"Less\",\"or Less\",\"\"))","v":"or Less"}]
[{"$f":"'Planning Data'!A57","v":"Foreclosure Notices"},"This measure description is currently unavailable.  We are working to include this data as soon as possible.","Unavailable",{"$f":"'Planning Data'!I57","v":129},{"$f":"'Planning Data'!B57","v":250},{"$f":"IF('Planning Data'!C57=\"More\",\"or More\",IF('Planning Data'!C57=\"Less\",\"or Less\",\"\"))","v":"or Less"}]
[{"$f":"'Planning Data'!A58","v":0},"This measure description is currently unavailable.  We are working to include this data as soon as possible.","Unavailable",{"$f":"'Planning Data'!I58","v":0},{"$f":"'Planning Data'!B58","v":0},{"$f":"IF('Planning Data'!C58=\"More\",\"or More\",IF('Planning Data'!C58=\"Less\",\"or Less\",\"\"))","v":""}]
[{"$f":"'Planning Data'!A59","v":0},"This measure description is currently unavailable.  We are working to include this data as soon as possible.","Unavailable",{"$f":"'Planning Data'!I59","v":0},{"$f":"'Planning Data'!B59","v":0},{"$f":"IF('Planning Data'!C59=\"More\",\"or More\",IF('Planning Data'!C59=\"Less\",\"or Less\",\"\"))","v":""}]
[{"$f":"'Planning Data'!A60","v":0},"This measure description is currently unavailable.  We are working to include this data as soon as possible.","Unavailable",{"$f":"'Planning Data'!I60","v":0},{"$f":"'Planning Data'!B60","v":0},{"$f":"IF('Planning Data'!C60=\"More\",\"or More\",IF('Planning Data'!C60=\"Less\",\"or Less\",\"\"))","v":""}]
[{"$f":"'Garage Data'!A41","v":"Vehicles Serviced (City)"},"This measure description is currently unavailable.  We are working to include this data as soon as possible.","Unavailable",{"$f":"'Garage Data'!I41","v":494},{"$f":"'Garage Data'!B41","v":900},{"$f":"IF('Garage Data'!C41=\"More\",\"or More\",IF('Garage Data'!C41=\"Less\",\"or Less\",\"\"))","v":""}]
[{"$f":"'Garage Data'!A42","v":"Vehicles Serviced (Other)"},"This measure description is currently unavailable.  We are working to include this data as soon as possible.","Unavailable",{"$f":"'Garage Data'!I42","v":21},{"$f":"'Garage Data'!B42","v":10},{"$f":"IF('Garage Data'!C42=\"More\",\"or More\",IF('Garage Data'!C42=\"Less\",\"or Less\",\"\"))","v":"or More"}]
[{"$f":"'Garage Data'!A43","v":"Billable Hours (City)"},"This measure description is currently unavailable.  We are working to include this data as soon as possible.","Unavailable",{"$f":"'Garage Data'!I43","v":1004.85},{"$f":"'Garage Data'!B43","v":1700},{"$f":"IF('Garage Data'!C43=\"More\",\"or More\",IF('Garage Data'!C43=\"Less\",\"or Less\",\"\"))","v":""}]
[{"$f":"'Garage Data'!A44","v":"Billable Hours (Other)"},"This measure description is currently unavailable.  We are working to include this data as soon as possible.","Unavailable",{"$f":"'Garage Data'!I44","v":39.5},{"$f":"'Garage Data'!B44","v":25},{"$f":"IF('Garage Data'!C44=\"More\",\"or More\",IF('Garage Data'!C44=\"Less\",\"or Less\",\"\"))","v":"or More"}]
[{"$f":"'Garage Data'!A45","v":"Billable Hours/Hours Paid"},"This measure description is currently unavailable.  We are working to include this data as soon as possible.","Unavailable",{"$f":"'Garage Data'!I45","v":0.25477033337084348},{"$f":"'Garage Data'!B45","v":0.25},{"$f":"IF('Garage Data'!C45=\"More\",\"or More\",IF('Garage Data'!C45=\"Less\",\"or Less\",\"\"))","v":"or More"}]
[{"$f":"'Garage Data'!A46","v":"Diesel Fuel Sold (City Only)"},"This measure description is currently unavailable.  We are working to include this data as soon as possible.","Unavailable",{"$f":"'Garage Data'!I46","v":43413.799999999996},{"$f":"'Garage Data'!B46","v":70000},{"$f":"IF('Garage Data'!C46=\"More\",\"or More\",IF('Garage Data'!C46=\"Less\",\"or Less\",\"\"))","v":"or Less"}]
[{"$f":"'Garage Data'!A47","v":"Diesel Fuel Sold (Other)"},"This measure description is currently unavailable.  We are working to include this data as soon as possible.","Unavailable",{"$f":"'Garage Data'!I47","v":31589},{"$f":"'Garage Data'!B47","v":50800},{"$f":"IF('Garage Data'!C47=\"More\",\"or More\",IF('Garage Data'!C47=\"Less\",\"or Less\",\"\"))","v":"or More"}]
[{"$f":"'Garage Data'!A48","v":"Unleaded Fuel Sold (City Only)"},"This measure description is currently unavailable.  We are working to include this data as soon as possible.","Unavailable",{"$f":"'Garage Data'!I48","v":78713.650000000009},{"$f":"'Garage Data'!B48","v":130000},{"$f":"IF('Garage Data'!C48=\"More\",\"or More\",IF('Garage Data'!C48=\"Less\",\"or Less\",\"\"))","v":"or Less"}]
[{"$f":"'Garage Data'!A49","v":"Unleaded Fuel Sold (Other)"},"This measure description is currently unavailable.  We are working to include this data as soon as possible.","Unavailable",{"$f":"'Garage Data'!I49","v":5879.05},{"$f":"'Garage Data'!B49","v":7800},{"$f":"IF('Garage Data'!C49=\"More\",\"or More\",IF('Garage Data'!C49=\"Less\",\"or Less\",\"\"))","v":"or More"}]
[{"$f":"'Garage Data'!A50","v":0},"This measure description is currently unavailable.  We are working to include this data as soon as possible.","Unavailable",{"$f":"'Garage Data'!I50","v":0},{"$f":"'Garage Data'!B50","v":0},{"$f":"IF('Garage Data'!C50=\"More\",\"or More\",IF('Garage Data'!C50=\"Less\",\"or Less\",\"\"))","v":""}]
[{"$f":"'Garage Data'!A51","v":0},"This measure description is currently unavailable.  We are working to include this data as soon as possible.","Unavailable",{"$f":"'Garage Data'!I51","v":0},{"$f":"'Garage Data'!B51","v":0},{"$f":"IF('Garage Data'!C51=\"More\",\"or More\",IF('Garage Data'!C51=\"Less\",\"or Less\",\"\"))","v":""}]
[{"$f":"'Garage Data'!A52","v":0},"This measure description is currently unavailable.  We are working to include this data as soon as possible.","Unavailable",{"$f":"'Garage Data'!I52","v":0},{"$f":"'Garage Data'!B52","v":0},{"$f":"IF('Garage Data'!C52=\"More\",\"or More\",IF('Garage Data'!C52=\"Less\",\"or Less\",\"\"))","v":""}]
[{"$f":"'Garage Data'!A53","v":0},"This measure description is currently unavailable.  We are working to include this data as soon as possible.","Unavailable",{"$f":"'Garage Data'!I53","v":0},{"$f":"'Garage Data'!B53","v":0},{"$f":"IF('Garage Data'!C53=\"More\",\"or More\",IF('Garage Data'!C53=\"Less\",\"or Less\",\"\"))","v":""}]
[{"$f":"'Garage Data'!A54","v":0},"This measure description is currently unavailable.  We are working to include this data as soon as possible.","Unavailable",{"$f":"'Garage Data'!I54","v":0},{"$f":"'Garage Data'!B54","v":0},{"$f":"IF('Garage Data'!C54=\"More\",\"or More\",IF('Garage Data'!C54=\"Less\",\"or Less\",\"\"))","v":""}]
[{"$f":"'Garage Data'!A55","v":0},"This measure description is currently unavailable.  We are working to include this data as soon as possible.","Unavailable",{"$f":"'Garage Data'!I55","v":0},{"$f":"'Garage Data'!B55","v":0},{"$f":"IF('Garage Data'!C55=\"More\",\"or More\",IF('Garage Data'!C55=\"Less\",\"or Less\",\"\"))","v":""}]
[{"$f":"'Garage Data'!A56","v":0},"This measure description is currently unavailable.  We are working to include this data as soon as possible.","Unavailable",{"$f":"'Garage Data'!I56","v":0},{"$f":"'Garage Data'!B56","v":0},{"$f":"IF('Garage Data'!C56=\"More\",\"or More\",IF('Garage Data'!C56=\"Less\",\"or Less\",\"\"))","v":""}]
[{"$f":"'Garage Data'!A57","v":0},"This measure description is currently unavailable.  We are working to include this data as soon as possible.","Unavailable",{"$f":"'Garage Data'!I57","v":0},{"$f":"'Garage Data'!B57","v":0},{"$f":"IF('Garage Data'!C57=\"More\",\"or More\",IF('Garage Data'!C57=\"Less\",\"or Less\",\"\"))","v":""}]
[{"$f":"'Garage Data'!A58","v":0},"This measure description is currently unavailable.  We are working to include this data as soon as possible.","Unavailable",{"$f":"'Garage Data'!I58","v":0},{"$f":"'Garage Data'!B58","v":0},{"$f":"IF('Garage Data'!C58=\"More\",\"or More\",IF('Garage Data'!C58=\"Less\",\"or Less\",\"\"))","v":""}]
[{"$f":"'Garage Data'!A59","v":0},"This measure description is currently unavailable.  We are working to include this data as soon as possible.","Unavailable",{"$f":"'Garage Data'!I59","v":0},{"$f":"'Garage Data'!B59","v":0},{"$f":"IF('Garage Data'!C59=\"More\",\"or More\",IF('Garage Data'!C59=\"Less\",\"or Less\",\"\"))","v":""}]
[{"$f":"'Garage Data'!A60","v":0},"This measure description is currently unavailable.  We are working to include this data as soon as possible.","Unavailable",{"$f":"'Garage Data'!I60","v":0},{"$f":"'Garage Data'!B60","v":0},{"$f":"IF('Garage Data'!C60=\"More\",\"or More\",IF('Garage Data'!C60=\"Less\",\"or Less\",\"\"))","v":""}]
[{"$f":"'Electric Data'!A41","v":"Residential kWh Consumption"},"This measure description is currently unavailable.  We are working to include this data as soon as possible.","Unavailable",{"$f":"'Electric Data'!I41","v":46749857},{"$f":"'Electric Data'!B41","v":81125713},{"$f":"IF('Electric Data'!C41=\"More\",\"or More\",IF('Electric Data'!C41=\"Less\",\"or Less\",\"\"))","v":"or More"}]
[{"$f":"'Electric Data'!A42","v":"Commercial kWh Consumption"},"This measure description is currently unavailable.  We are working to include this data as soon as possible.","Unavailable",{"$f":"'Electric Data'!I42","v":77666920},{"$f":"'Electric Data'!B42","v":126769661},{"$f":"IF('Electric Data'!C42=\"More\",\"or More\",IF('Electric Data'!C42=\"Less\",\"or Less\",\"\"))","v":"or More"}]
[{"$f":"'Electric Data'!A43","v":"Industrial kWh Consumption"},"This measure description is currently unavailable.  We are working to include this data as soon as possible.","Unavailable",{"$f":"'Electric Data'!I43","v":195969660},{"$f":"'Electric Data'!B43","v":329764170},{"$f":"IF('Electric Data'!C43=\"More\",\"or More\",IF('Electric Data'!C43=\"Less\",\"or Less\",\"\"))","v":"or More"}]
[{"$f":"'Electric Data'!A44","v":"Government kWh Consumption"},"This measure description is currently unavailable.  We are working to include this data as soon as possible.","Unavailable",{"$f":"'Electric Data'!I44","v":5909839},{"$f":"'Electric Data'!B44","v":10436878},{"$f":"IF('Electric Data'!C44=\"More\",\"or More\",IF('Electric Data'!C44=\"Less\",\"or Less\",\"\"))","v":"or Less"}]
[{"$f":"'Electric Data'!A45","v":"External Source Service Outages"},"This measure description is currently unavailable.  We are working to include this data as soon as possible.","Unavailable",{"$f":"'Electric Data'!I45","v":8.2857142857142865},{"$f":"'Electric Data'!B45","v":0},{"$f":"IF('Electric Data'!C45=\"More\",\"or More\",IF('Electric Data'!C45=\"Less\",\"or Less\",\"\"))","v":"or Less"}]
[{"$f":"'Electric Data'!A46","v":"System Failure Service Outages"},"This measure description is currently unavailable.  We are working to include this data as soon as possible.","Unavailable",{"$f":"'Electric Data'!I46","v":10},{"$f":"'Electric Data'!B46","v":0},{"$f":"IF('Electric Data'!C46=\"More\",\"or More\",IF('Electric Data'!C46=\"Less\",\"or Less\",\"\"))","v":"or Less"}]
[{"$f":"'Electric Data'!A47","v":"Average Residential Rate per kWh (₵/kWh)"},"This measure description is currently unavailable.  We are working to include this data as soon as possible.","Unavailable",{"$f":"'Electric Data'!I47","v":10.365714285714287},{"$f":"'Electric Data'!B47","v":9.34},{"$f":"IF('Electric Data'!C47=\"More\",\"or More\",IF('Electric Data'!C47=\"Less\",\"or Less\",\"\"))","v":"or Less"}]
[{"$f":"'Electric Data'!A48","v":"Georgia Power Residential Rate (₵/kWh)"},"This measure description is currently unavailable.  We are working to include this data as soon as possible.","Unavailable",{"$f":"'Electric Data'!I48","v":{"$error":"#N/A"}},{"$f":"'Electric Data'!B48","v":9.34},{"$f":"IF('Electric Data'!C48=\"More\",\"or More\",IF('Electric Data'!C48=\"Less\",\"or Less\",\"\"))","v":"or More"}]
[{"$f":"'Electric Data'!A49","v":"Pole Inspections Completed"},"This measure description is currently unavailable.  We are working to include this data as soon as possible.","Unavailable",{"$f":"'Electric Data'!I49","v":248},{"$f":"'Electric Data'!B49","v":500},{"$f":"IF('Electric Data'!C49=\"More\",\"or More\",IF('Electric Data'!C49=\"Less\",\"or Less\",\"\"))","v":""}]
[{"$f":"'Electric Data'!A50","v":"Walk-thru Energy Audits Performed"},"This measure description is currently unavailable.  We are working to include this data as soon as possible.","Unavailable",{"$f":"'Electric Data'!I50","v":0},{"$f":"'Electric Data'!B50","v":15},{"$f":"IF('Electric Data'!C50=\"More\",\"or More\",IF('Electric Data'!C50=\"Less\",\"or Less\",\"\"))","v":"or More"}]
[{"$f":"'Electric Data'!A51","v":"Home Performance Inspections Performed"},"This measure description is currently unavailable.  We are working to include this data as soon as possible.","Unavailable",{"$f":"'Electric Data'!I51","v":3},{"$f":"'Electric Data'!B51","v":18},{"$f":"IF('Electric Data'!C51=\"More\",\"or More\",IF('Electric Data'!C51=\"Less\",\"or Less\",\"\"))","v":"or More"}]
[{"$f":"'Electric Data'!A52","v":"Grant Dollars Paid Out"},"This measure description is currently unavailable.  We are working to include this data as soon as possible.","Unavailable",{"$f":"'Electric Data'!I52","v":3361.5},{"$f":"'Electric Data'!B52","v":12500},{"$f":"IF('Electric Data'!C52=\"More\",\"or More\",IF('Electric Data'!C52=\"Less\",\"or Less\",\"\"))","v":"or More"}]
[{"$f":"'Electric Data'!A53","v":0},"This measure description is currently unavailable.  We are working to include this data as soon as possible.","Unavailable",{"$f":"'Electric Data'!I53","v":0},{"$f":"'Electric Data'!B53","v":0},{"$f":"IF('Electric Data'!C53=\"More\",\"or More\",IF('Electric Data'!C53=\"Less\",\"or Less\",\"\"))","v":""}]
[{"$f":"'Electric Data'!A54","v":0},"This measure description is currently unavailable.  We are working to include this data as soon as possible.","Unavailable",{"$f":"'Electric Data'!I54","v":0},{"$f":"'Electric Data'!B54","v":0},{"$f":"IF('Electric Data'!C54=\"More\",\"or More\",IF('Electric Data'!C54=\"Less\",\"or Less\",\"\"))","v":""}]
[{"$f":"'Electric Data'!A55","v":0},"This measure description is currently unavailable.  We are working to include this data as soon as possible.","Unavailable",{"$f":"'Electric Data'!I55","v":0},{"$f":"'Electric Data'!B55","v":0},{"$f":"IF('Electric Data'!C55=\"More\",\"or More\",IF('Electric Data'!C55=\"Less\",\"or Less\",\"\"))","v":""}]
[{"$f":"'Electric Data'!A56","v":0},"This measure description is currently unavailable.  We are working to include this data as soon as possible.","Unavailable",{"$f":"'Electric Data'!I56","v":0},{"$f":"'Electric Data'!B56","v":0},{"$f":"IF('Electric Data'!C56=\"More\",\"or More\",IF('Electric Data'!C56=\"Less\",\"or Less\",\"\"))","v":""}]
[{"$f":"'Electric Data'!A57","v":0},"This measure description is currently unavailable.  We are working to include this data as soon as possible.","Unavailable",{"$f":"'Electric Data'!I57","v":0},{"$f":"'Electric Data'!B57","v":0},{"$f":"IF('Electric Data'!C57=\"More\",\"or More\",IF('Electric Data'!C57=\"Less\",\"or Less\",\"\"))","v":""}]
[{"$f":"'Electric Data'!A58","v":0},"This measure description is currently unavailable.  We are working to include this data as soon as possible.","Unavailable",{"$f":"'Electric Data'!I58","v":0},{"$f":"'Electric Data'!B58","v":0},{"$f":"IF('Electric Data'!C58=\"More\",\"or More\",IF('Electric Data'!C58=\"Less\",\"or Less\",\"\"))","v":""}]
[{"$f":"'Electric Data'!A59","v":0},"This measure description is currently unavailable.  We are working to include this data as soon as possible.","Unavailable",{"$f":"'Electric Data'!I59","v":0},{"$f":"'Electric Data'!B59","v":0},{"$f":"IF('Electric Data'!C59=\"More\",\"or More\",IF('Electric Data'!C59=\"Less\",\"or Less\",\"\"))","v":""}]
[{"$f":"'Electric Data'!A60","v":0},"This measure description is currently unavailable.  We are working to include this data as soon as possible.","Unavailable",{"$f":"'Electric Data'!I60","v":0},{"$f":"'Electric Data'!B60","v":0},{"$f":"IF('Electric Data'!C60=\"More\",\"or More\",IF('Electric Data'!C60=\"Less\",\"or Less\",\"\"))","v":""}]
[{"$f":"'Gas Data'!A41","v":"Residential MCF Consumption"},"This measure description is currently unavailable.  We are working to include this data as soon as possible.","Unavailable",{"$f":"'Gas Data'!I41","v":239927},{"$f":"'Gas Data'!B41","v":517170},{"$f":"IF('Gas Data'!C41=\"More\",\"or More\",IF('Gas Data'!C41=\"Less\",\"or Less\",\"\"))","v":"or More"}]
[{"$f":"'Gas Data'!A42","v":"Commercial MCF Consumption"},"This measure description is currently unavailable.  We are working to include this data as soon as possible.","Unavailable",{"$f":"'Gas Data'!I42","v":166713},{"$f":"'Gas Data'!B42","v":343104},{"$f":"IF('Gas Data'!C42=\"More\",\"or More\",IF('Gas Data'!C42=\"Less\",\"or Less\",\"\"))","v":"or More"}]
[{"$f":"'Gas Data'!A43","v":"Industrial MCF Consumption"},"This measure description is currently unavailable.  We are working to include this data as soon as possible.","Unavailable",{"$f":"'Gas Data'!I43","v":1501048},{"$f":"'Gas Data'!B43","v":2557565},{"$f":"IF('Gas Data'!C43=\"More\",\"or More\",IF('Gas Data'!C43=\"Less\",\"or Less\",\"\"))","v":"or More"}]
[{"$f":"'Gas Data'!A44","v":"Number of Service Outages"},"This measure description is currently unavailable.  We are working to include this data as soon as possible.","Unavailable",{"$f":"'Gas Data'!I44","v":0},{"$f":"'Gas Data'!B44","v":1},{"$f":"IF('Gas Data'!C44=\"More\",\"or More\",IF('Gas Data'!C44=\"Less\",\"or Less\",\"\"))","v":"or Less"}]
[{"$f":"'Gas Data'!A45","v":"Price per Therm"},"This measure description is currently unavailable.  We are working to include this data as soon as possible.","Unavailable",{"$f":"'Gas Data'!I45","v":1.337142857142857},{"$f":"'Gas Data'!B45","v":1.25},{"$f":"IF('Gas Data'!C45=\"More\",\"or More\",IF('Gas Data'!C45=\"Less\",\"or Less\",\"\"))","v":"or Less"}]
[{"$f":"'Gas Data'!A46","v":"Lowest AGL Marketer Price per Therm"},"This measure description is currently unavailable.  We are working to include this data as soon as possible.","Unavailable",{"$f":"'Gas Data'!I46","v":1.7828571428571429},{"$f":"'Gas Data'!B46","v":1.42},{"$f":"IF('Gas Data'!C46=\"More\",\"or More\",IF('Gas Data'!C46=\"Less\",\"or Less\",\"\"))","v":"or More"}]
[{"$f":"'Gas Data'!A47","v":"Utility Locates Performed"},"This measure description is currently unavailable.  We are working to include this data as soon as possible.","Unavailable",{"$f":"'Gas Data'!I47","v":10193},{"$f":"'Gas Data'!B47","v":14173},{"$f":"IF('Gas Data'!C47=\"More\",\"or More\",IF('Gas Data'!C47=\"Less\",\"or Less\",\"\"))","v":""}]
[{"$f":"'Gas Data'!A48","v":"Linear Miles of Right of Way Mowed"},"This measure description is currently unavailable.  We are working to include this data as soon as possible.","Unavailable",{"$f":"'Gas Data'!I48","v":32.159999999999997},{"$f":"'Gas Data'!B48","v":29},{"$f":"IF('Gas Data'!C48=\"More\",\"or More\",IF('Gas Data'!C48=\"Less\",\"or Less\",\"\"))","v":""}]
[{"$f":"'Gas Data'!A49","v":"Service Lines Surveyed"},"This measure description is currently unavailable.  We are working to include this data as soon as possible.","Unavailable",{"$f":"'Gas Data'!I49","v":1848},{"$f":"'Gas Data'!B49","v":4028},{"$f":"IF('Gas Data'!C49=\"More\",\"or More\",IF('Gas Data'!C49=\"Less\",\"or Less\",\"\"))","v":""}]
[{"$f":"'Gas Data'!A50","v":"Linear Miles of Main Surveyed"},"This measure description is currently unavailable.  We are working to include this data as soon as possible.","Unavailable",{"$f":"'Gas Data'!I50","v":79.22},{"$f":"'Gas Data'!B50","v":156},{"$f":"IF('Gas Data'!C50=\"More\",\"or More\",IF('Gas Data'!C50=\"Less\",\"or Less\",\"\"))","v":""}]
[{"$f":"'Gas Data'!A51","v":0},"This measure description is currently unavailable.  We are working to include this data as soon as possible.","Unavailable",{"$f":"'Gas Data'!I51","v":0},{"$f":"'Gas Data'!B51","v":0},{"$f":"IF('Gas Data'!C51=\"More\",\"or More\",IF('Gas Data'!C51=\"Less\",\"or Less\",\"\"))","v":""}]
[{"$f":"'Gas Data'!A52","v":0},"This measure description is currently unavailable.  We are working to include this data as soon as possible.","Unavailable",{"$f":"'Gas Data'!I52","v":0},{"$f":"'Gas Data'!B52","v":0},{"$f":"IF('Gas Data'!C52=\"More\",\"or More\",IF('Gas Data'!C52=\"Less\",\"or Less\",\"\"))","v":""}]
[{"$f":"'Gas Data'!A53","v":0},"This measure description is currently unavailable.  We are working to include this data as soon as possible.","Unavailable",{"$f":"'Gas Data'!I53","v":0},{"$f":"'Gas Data'!B53","v":0},{"$f":"IF('Gas Data'!C53=\"More\",\"or More\",IF('Gas Data'!C53=\"Less\",\"or Less\",\"\"))","v":""}]
[{"$f":"'Gas Data'!A54","v":0},"This measure description is currently unavailable.  We are working to include this data as soon as possible.","Unavailable",{"$f":"'Gas Data'!I54","v":0},{"$f":"'Gas Data'!B54","v":0},{"$f":"IF('Gas Data'!C54=\"More\",\"or More\",IF('Gas Data'!C54=\"Less\",\"or Less\",\"\"))","v":""}]
[{"$f":"'Gas Data'!A55","v":0},"This measure description is currently unavailable.  We are working to include this data as soon as possible.","Unavailable",{"$f":"'Gas Data'!I55","v":0},{"$f":"'Gas Data'!B55","v":0},{"$f":"IF('Gas Data'!C55=\"More\",\"or More\",IF('Gas Data'!C55=\"Less\",\"or Less\",\"\"))","v":""}]
[{"$f":"'Gas Data'!A56","v":0},"This measure description is currently unavailable.  We are working to include this data as soon as possible.","Unavailable",{"$f":"'Gas Data'!I56","v":0},{"$f":"'Gas Data'!B56","v":0},{"$f":"IF('Gas Data'!C56=\"More\",\"or More\",IF('Gas Data'!C56=\"Less\",\"or Less\",\"\"))","v":""}]
[{"$f":"'Gas Data'!A57","v":0},"This measure description is currently unavailable.  We are working to include this data as soon as possible.","Unavailable",{"$f":"'Gas Data'!I57","v":0},{"$f":"'Gas Data'!B57","v":0},{"$f":"IF('Gas Data'!C57=\"More\",\"or More\",IF('Gas Data'!C57=\"Less\",\"or Less\",\"\"))","v":""}]
[{"$f":"'Gas Data'!A58","v":0},"This measure description is currently unavailable.  We are working to include this data as soon as possible.","Unavailable",{"$f":"'Gas Data'!I58","v":0},{"$f":"'Gas Data'!B58","v":0},{"$f":"IF('Gas Data'!C58=\"More\",\"or More\",IF('Gas Data'!C58=\"Less\",\"or Less\",\"\"))","v":""}]
[{"$f":"'Gas Data'!A59","v":0},"This measure description is currently unavailable.  We are working to include this data as soon as possible.","Unavailable",{"$f":"'Gas Data'!I59","v":0},{"$f":"'Gas Data'!B59","v":0},{"$f":"IF('Gas Data'!C59=\"More\",\"or More\",IF('Gas Data'!C59=\"Less\",\"or Less\",\"\"))","v":""}]
[{"$f":"'Gas Data'!A60","v":0},"This measure description is currently unavailable.  We are working to include this data as soon as possible.","Unavailable",{"$f":"'Gas Data'!I60","v":0},{"$f":"'Gas Data'!B60","v":0},{"$f":"IF('Gas Data'!C60=\"More\",\"or More\",IF('Gas Data'!C60=\"Less\",\"or Less\",\"\"))","v":""}]
[{"$f":"'Water Data'!A41","v":"Residential Water Consumption"},"This measure description is currently unavailable.  We are working to include this data as soon as possible.","Unavailable",{"$f":"'Water Data'!I41","v":392802},{"$f":"'Water Data'!B41","v":645000},{"$f":"IF('Water Data'!C41=\"More\",\"or More\",IF('Water Data'!C41=\"Less\",\"or Less\",\"\"))","v":"or More"}]
[{"$f":"'Water Data'!A42","v":"Commercial Water Consumption"},"This measure description is currently unavailable.  We are working to include this data as soon as possible.","Unavailable",{"$f":"'Water Data'!I42","v":229030},{"$f":"'Water Data'!B42","v":390000},{"$f":"IF('Water Data'!C42=\"More\",\"or More\",IF('Water Data'!C42=\"Less\",\"or Less\",\"\"))","v":"or More"}]
[{"$f":"'Water Data'!A43","v":"Industrial Water Consumption"},"This measure description is currently unavailable.  We are working to include this data as soon as possible.","Unavailable",{"$f":"'Water Data'!I43","v":2167154},{"$f":"'Water Data'!B43","v":3600000},{"$f":"IF('Water Data'!C43=\"More\",\"or More\",IF('Water Data'!C43=\"Less\",\"or Less\",\"\"))","v":"or More"}]
[{"$f":"'Water Data'!A44","v":"Sanitary Sewer Overflows"},"This measure description is currently unavailable.  We are working to include this data as soon as possible.","Unavailable",{"$f":"'Water Data'!I44","v":0},{"$f":"'Water Data'!B44","v":0},{"$f":"IF('Water Data'!C44=\"More\",\"or More\",IF('Water Data'!C44=\"Less\",\"or Less\",\"\"))","v":"or Less"}]
[{"$f":"'Water Data'!A45","v":"Permit Violation - Water Treatment"},"This measure description is currently unavailable.  We are working to include this data as soon as possible.","Unavailable",{"$f":"'Water Data'!I45","v":0},{"$f":"'Water Data'!B45","v":0},{"$f":"IF('Water Data'!C45=\"More\",\"or More\",IF('Water Data'!C45=\"Less\",\"or Less\",\"\"))","v":"or Less"}]
[{"$f":"'Water Data'!A46","v":"Permit Violation - Wastewater Treatment"},"This measure description is currently unavailable.  We are working to include this data as soon as possible.","Unavailable",{"$f":"'Water Data'!I46","v":0},{"$f":"'Water Data'!B46","v":0},{"$f":"IF('Water Data'!C46=\"More\",\"or More\",IF('Water Data'!C46=\"Less\",\"or Less\",\"\"))","v":"or Less"}]
[{"$f":"'Water Data'!A47","v":"Water Samples Out of Compliance"},"This measure description is currently unavailable.  We are working to include this data as soon as possible.","Unavailable",{"$f":"'Water Data'!I47","v":2},{"$f":"'Water Data'!B47","v":0},{"$f":"IF('Water Data'!C47=\"More\",\"or More\",IF('Water Data'!C47=\"Less\",\"or Less\",\"\"))","v":"or Less"}]
[{"$f":"'Water Data'!A48","v":"Water Compliance Fines"},"This measure description is currently unavailable.  We are working to include this data as soon as possible.","Unavailable",{"$f":"'Water Data'!I48","v":0},{"$f":"'Water Data'!B48","v":0},{"$f":"IF('Water Data'!C48=\"More\",\"or More\",IF('Water Data'!C48=\"Less\",\"or Less\",\"\"))","v":"or Less"}]
[{"$f":"'Water Data'!A49","v":"Service Outages"},"This measure description is currently unavailable.  We are working to include this data as soon as possible.","Unavailable",{"$f":"'Water Data'!I49","v":0},{"$f":"'Water Data'!B49","v":50},{"$f":"IF('Water Data'!C49=\"More\",\"or More\",IF('Water Data'!C49=\"Less\",\"or Less\",\"\"))","v":"or Less"}]
[{"$f":"'Water Data'!A50","v":"Average Cost for 7,500 Gallons/Competitor Average"},"Cartersville Water strives to offer customers high quality water and sewer services at low rates.  Currently, our combined rates are in the lowest 5% statewide.  This measure is a ratio of our combined water and sewer rates compared to the rates of three surrounding jurisdictions: Dalton, Cobb, and Calhoun.","Unavailable",{"$f":"'Water Data'!I50","v":0.72817018984785242},{"$f":"'Water Data'!B50","v":1},{"$f":"IF('Water Data'!C50=\"More\",\"or More\",IF('Water Data'!C50=\"Less\",\"or Less\",\"\"))","v":"or Less"}]
[{"$f":"'Water Data'!A51","v":"Distribution System Water Loss (Rolling Average)"},"This measure description is currently unavailable.  We are working to include this data as soon as possible.","Unavailable",{"$f":"'Water Data'!I51","v":0.1046857142857143},{"$f":"'Water Data'!B51","v":0.1},{"$f":"IF('Water Data'!C51=\"More\",\"or More\",IF('Water Data'!C51=\"Less\",\"or Less\",\"\"))","v":"or Less"}]
[{"$f":"'Water Data'!A52","v":0},"This measure description is currently unavailable.  We are working to include this data as soon as possible.","Unavailable",{"$f":"'Water Data'!I52","v":0},{"$f":"'Water Data'!B52","v":0},{"$f":"IF('Water Data'!C52=\"More\",\"or More\",IF('Water Data'!C52=\"Less\",\"or Less\",\"\"))","v":""}]
[{"$f":"'Water Data'!A53","v":0},"This measure description is currently unavailable.  We are working to include this data as soon as possible.","Unavailable",{"$f":"'Water Data'!I53","v":0},{"$f":"'Water Data'!B53","v":0},{"$f":"IF('Water Data'!C53=\"More\",\"or More\",IF('Water Data'!C53=\"Less\",\"or Less\",\"\"))","v":""}]
[{"$f":"'Water Data'!A54","v":0},"This measure description is currently unavailable.  We are working to include this data as soon as possible.","Unavailable",{"$f":"'Water Data'!I54","v":0},{"$f":"'Water Data'!B54","v":0},{"$f":"IF('Water Data'!C54=\"More\",\"or More\",IF('Water Data'!C54=\"Less\",\"or Less\",\"\"))","v":""}]
[{"$f":"'Water Data'!A55","v":0},"This measure description is currently unavailable.  We are working to include this data as soon as possible.","Unavailable",{"$f":"'Water Data'!I55","v":0},{"$f":"'Water Data'!B55","v":0},{"$f":"IF('Water Data'!C55=\"More\",\"or More\",IF('Water Data'!C55=\"Less\",\"or Less\",\"\"))","v":""}]
[{"$f":"'Water Data'!A56","v":0},"This measure description is currently unavailable.  We are working to include this data as soon as possible.","Unavailable",{"$f":"'Water Data'!I56","v":0},{"$f":"'Water Data'!B56","v":0},{"$f":"IF('Water Data'!C56=\"More\",\"or More\",IF('Water Data'!C56=\"Less\",\"or Less\",\"\"))","v":""}]
[{"$f":"'Water Data'!A57","v":0},"This measure description is currently unavailable.  We are working to include this data as soon as possible.","Unavailable",{"$f":"'Water Data'!I57","v":0},{"$f":"'Water Data'!B57","v":0},{"$f":"IF('Water Data'!C57=\"More\",\"or More\",IF('Water Data'!C57=\"Less\",\"or Less\",\"\"))","v":""}]
[{"$f":"'Water Data'!A58","v":0},"This measure description is currently unavailable.  We are working to include this data as soon as possible.","Unavailable",{"$f":"'Water Data'!I58","v":0},{"$f":"'Water Data'!B58","v":0},{"$f":"IF('Water Data'!C58=\"More\",\"or More\",IF('Water Data'!C58=\"Less\",\"or Less\",\"\"))","v":""}]
[{"$f":"'Water Data'!A59","v":0},"This measure description is currently unavailable.  We are working to include this data as soon as possible.","Unavailable",{"$f":"'Water Data'!I59","v":0},{"$f":"'Water Data'!B59","v":0},{"$f":"IF('Water Data'!C59=\"More\",\"or More\",IF('Water Data'!C59=\"Less\",\"or Less\",\"\"))","v":""}]
[{"$f":"'Water Data'!A60","v":0},"This measure description is currently unavailable.  We are working to include this data as soon as possible.","Unavailable",{"$f":"'Water Data'!I60","v":0},{"$f":"'Water Data'!B60","v":0},{"$f":"IF('Water Data'!C60=\"More\",\"or More\",IF('Water Data'!C60=\"Less\",\"or Less\",\"\"))","v":""}]
[{"$f":"'Solid Data'!A41","v":"Residential Solid Waste Collected per Collection Day (Tons)"},"This measure description is currently unavailable.  We are working to include this data as soon as possible.","Unavailable",{"$f":"'Solid Data'!I41","v":23.09714285714286},{"$f":"'Solid Data'!B41","v":23},{"$f":"IF('Solid Data'!C41=\"More\",\"or More\",IF('Solid Data'!C41=\"Less\",\"or Less\",\"\"))","v":"or Less"}]
[{"$f":"'Solid Data'!A42","v":"Commercial Solid Waste Collected per Collection Day (Tons)"},"This measure description is currently unavailable.  We are working to include this data as soon as possible.","Unavailable",{"$f":"'Solid Data'!I42","v":17.654285714285717},{"$f":"'Solid Data'!B42","v":20},{"$f":"IF('Solid Data'!C42=\"More\",\"or More\",IF('Solid Data'!C42=\"Less\",\"or Less\",\"\"))","v":"or Less"}]
[{"$f":"'Solid Data'!A43","v":"Landfill Expense per Collection Day - Residential"},"This measure description is currently unavailable.  We are working to include this data as soon as possible.","Unavailable",{"$f":"'Solid Data'!I43","v":646.69428571428568},{"$f":"'Solid Data'!B43","v":649},{"$f":"IF('Solid Data'!C43=\"More\",\"or More\",IF('Solid Data'!C43=\"Less\",\"or Less\",\"\"))","v":"or Less"}]
[{"$f":"'Solid Data'!A44","v":"Landfill Expense per Collection Day - Commercial"},"This measure description is currently unavailable.  We are working to include this data as soon as possible.","Unavailable",{"$f":"'Solid Data'!I44","v":494.33714285714279},{"$f":"'Solid Data'!B44","v":566},{"$f":"IF('Solid Data'!C44=\"More\",\"or More\",IF('Solid Data'!C44=\"Less\",\"or Less\",\"\"))","v":"or Less"}]
[{"$f":"'Solid Data'!A45","v":"Average Number of Receptacles Collected per Route-hour"},"This measure description is currently unavailable.  We are working to include this data as soon as possible.","Unavailable",{"$f":"'Solid Data'!I45","v":95.285714285714292},{"$f":"'Solid Data'!B45","v":99},{"$f":"IF('Solid Data'!C45=\"More\",\"or More\",IF('Solid Data'!C45=\"Less\",\"or Less\",\"\"))","v":"or More"}]
[{"$f":"'Solid Data'!A46","v":"Curbies Missed While Conducting Normal Pick-up"},"This measure description is currently unavailable.  We are working to include this data as soon as possible.","Unavailable",{"$f":"'Solid Data'!I46","v":29},{"$f":"'Solid Data'!B46","v":128},{"$f":"IF('Solid Data'!C46=\"More\",\"or More\",IF('Solid Data'!C46=\"Less\",\"or Less\",\"\"))","v":"or Less"}]
[{"$f":"'Solid Data'!A47","v":"Complaints Received"},"This measure description is currently unavailable.  We are working to include this data as soon as possible.","Unavailable",{"$f":"'Solid Data'!I47","v":28},{"$f":"'Solid Data'!B47","v":141},{"$f":"IF('Solid Data'!C47=\"More\",\"or More\",IF('Solid Data'!C47=\"Less\",\"or Less\",\"\"))","v":"or Less"}]
[{"$f":"'Solid Data'!A48","v":"Staff Injuries (Solid Waste)"},"This measure description is currently unavailable.  We are working to include this data as soon as possible.","Unavailable",{"$f":"'Solid Data'!I48","v":3},{"$f":"'Solid Data'!B48","v":2},{"$f":"IF('Solid Data'!C48=\"More\",\"or More\",IF('Solid Data'!C48=\"Less\",\"or Less\",\"\"))","v":"or Less"}]
[{"$f":"'Solid Data'!A49","v":0},"This measure description is currently unavailable.  We are working to include this data as soon as possible.","Unavailable",{"$f":"'Solid Data'!I49","v":0},{"$f":"'Solid Data'!B49","v":0},{"$f":"IF('Solid Data'!C49=\"More\",\"or More\",IF('Solid Data'!C49=\"Less\",\"or Less\",\"\"))","v":""}]
[{"$f":"'Solid Data'!A50","v":0},"This measure description is currently unavailable.  We are working to include this data as soon as possible.","Unavailable",{"$f":"'Solid Data'!I50","v":0},{"$f":"'Solid Data'!B50","v":0},{"$f":"IF('Solid Data'!C50=\"More\",\"or More\",IF('Solid Data'!C50=\"Less\",\"or Less\",\"\"))","v":""}]
[{"$f":"'Solid Data'!A51","v":0},"This measure description is currently unavailable.  We are working to include this data as soon as possible.","Unavailable",{"$f":"'Solid Data'!I51","v":0},{"$f":"'Solid Data'!B51","v":0},{"$f":"IF('Solid Data'!C51=\"More\",\"or More\",IF('Solid Data'!C51=\"Less\",\"or Less\",\"\"))","v":""}]
[{"$f":"'Solid Data'!A52","v":0},"This measure description is currently unavailable.  We are working to include this data as soon as possible.","Unavailable",{"$f":"'Solid Data'!I52","v":0},{"$f":"'Solid Data'!B52","v":0},{"$f":"IF('Solid Data'!C52=\"More\",\"or More\",IF('Solid Data'!C52=\"Less\",\"or Less\",\"\"))","v":""}]
[{"$f":"'Solid Data'!A53","v":0},"This measure description is currently unavailable.  We are working to include this data as soon as possible.","Unavailable",{"$f":"'Solid Data'!I53","v":0},{"$f":"'Solid Data'!B53","v":0},{"$f":"IF('Solid Data'!C53=\"More\",\"or More\",IF('Solid Data'!C53=\"Less\",\"or Less\",\"\"))","v":""}]
[{"$f":"'Solid Data'!A54","v":0},"This measure description is currently unavailable.  We are working to include this data as soon as possible.","Unavailable",{"$f":"'Solid Data'!I54","v":0},{"$f":"'Solid Data'!B54","v":0},{"$f":"IF('Solid Data'!C54=\"More\",\"or More\",IF('Solid Data'!C54=\"Less\",\"or Less\",\"\"))","v":""}]
[{"$f":"'Solid Data'!A55","v":0},"This measure description is currently unavailable.  We are working to include this data as soon as possible.","Unavailable",{"$f":"'Solid Data'!I55","v":0},{"$f":"'Solid Data'!B55","v":0},{"$f":"IF('Solid Data'!C55=\"More\",\"or More\",IF('Solid Data'!C55=\"Less\",\"or Less\",\"\"))","v":""}]
[{"$f":"'Solid Data'!A56","v":0},"This measure description is currently unavailable.  We are working to include this data as soon as possible.","Unavailable",{"$f":"'Solid Data'!I56","v":0},{"$f":"'Solid Data'!B56","v":0},{"$f":"IF('Solid Data'!C56=\"More\",\"or More\",IF('Solid Data'!C56=\"Less\",\"or Less\",\"\"))","v":""}]
[{"$f":"'Solid Data'!A57","v":0},"This measure description is currently unavailable.  We are working to include this data as soon as possible.","Unavailable",{"$f":"'Solid Data'!I57","v":0},{"$f":"'Solid Data'!B57","v":0},{"$f":"IF('Solid Data'!C57=\"More\",\"or More\",IF('Solid Data'!C57=\"Less\",\"or Less\",\"\"))","v":""}]
[{"$f":"'Solid Data'!A58","v":0},"This measure description is currently unavailable.  We are working to include this data as soon as possible.","Unavailable",{"$f":"'Solid Data'!I58","v":0},{"$f":"'Solid Data'!B58","v":0},{"$f":"IF('Solid Data'!C58=\"More\",\"or More\",IF('Solid Data'!C58=\"Less\",\"or Less\",\"\"))","v":""}]
[{"$f":"'Solid Data'!A59","v":0},"This measure description is currently unavailable.  We are working to include this data as soon as possible.","Unavailable",{"$f":"'Solid Data'!I59","v":0},{"$f":"'Solid Data'!B59","v":0},{"$f":"IF('Solid Data'!C59=\"More\",\"or More\",IF('Solid Data'!C59=\"Less\",\"or Less\",\"\"))","v":""}]
[{"$f":"'Solid Data'!A60","v":0},"This measure description is currently unavailable.  We are working to include this data as soon as possible.","Unavailable",{"$f":"'Solid Data'!I60","v":0},{"$f":"'Solid Data'!B60","v":0},{"$f":"IF('Solid Data'!C60=\"More\",\"or More\",IF('Solid Data'!C60=\"Less\",\"or Less\",\"\"))","v":""}]
[{"$f":"'Storm Data'!A41","v":"Catch Basins Cleaned"},"This measure description is currently unavailable.  We are working to include this data as soon as possible.","Unavailable",{"$f":"'Storm Data'!I41","v":1229},{"$f":"'Storm Data'!B41","v":3875},{"$f":"IF('Storm Data'!C41=\"More\",\"or More\",IF('Storm Data'!C41=\"Less\",\"or Less\",\"\"))","v":"or More"}]
[{"$f":"'Storm Data'!A42","v":"Storm Pipe Cleaned (Linear Feet)"},"This measure description is currently unavailable.  We are working to include this data as soon as possible.","Unavailable",{"$f":"'Storm Data'!I42","v":1735},{"$f":"'Storm Data'!B42","v":2369},{"$f":"IF('Storm Data'!C42=\"More\",\"or More\",IF('Storm Data'!C42=\"Less\",\"or Less\",\"\"))","v":"or More"}]
[{"$f":"'Storm Data'!A43","v":"Ditch Cleaned/Dug Out/Mowed"},"This measure description is currently unavailable.  We are working to include this data as soon as possible.","Unavailable",{"$f":"'Storm Data'!I43","v":6378},{"$f":"'Storm Data'!B43","v":14285},{"$f":"IF('Storm Data'!C43=\"More\",\"or More\",IF('Storm Data'!C43=\"Less\",\"or Less\",\"\"))","v":"or More"}]
[{"$f":"'Storm Data'!A44","v":"Street Sweeping Miles per Day"},"This measure description is currently unavailable.  We are working to include this data as soon as possible.","Unavailable",{"$f":"'Storm Data'!I44","v":48.688571428571429},{"$f":"'Storm Data'!B44","v":49},{"$f":"IF('Storm Data'!C44=\"More\",\"or More\",IF('Storm Data'!C44=\"Less\",\"or Less\",\"\"))","v":"or More"}]
[{"$f":"'Storm Data'!A45","v":"Flooding Occurances Reported"},"This measure description is currently unavailable.  We are working to include this data as soon as possible.","Unavailable",{"$f":"'Storm Data'!I45","v":25},{"$f":"'Storm Data'!B45","v":32},{"$f":"IF('Storm Data'!C45=\"More\",\"or More\",IF('Storm Data'!C45=\"Less\",\"or Less\",\"\"))","v":"or Less"}]
[{"$f":"'Storm Data'!A46","v":0},"This measure description is currently unavailable.  We are working to include this data as soon as possible.","Unavailable",{"$f":"'Storm Data'!I46","v":0},{"$f":"'Storm Data'!B46","v":0},{"$f":"IF('Storm Data'!C46=\"More\",\"or More\",IF('Storm Data'!C46=\"Less\",\"or Less\",\"\"))","v":""}]
[{"$f":"'Storm Data'!A47","v":0},"This measure description is currently unavailable.  We are working to include this data as soon as possible.","Unavailable",{"$f":"'Storm Data'!I47","v":0},{"$f":"'Storm Data'!B47","v":0},{"$f":"IF('Storm Data'!C47=\"More\",\"or More\",IF('Storm Data'!C47=\"Less\",\"or Less\",\"\"))","v":""}]
[{"$f":"'Storm Data'!A48","v":0},"This measure description is currently unavailable.  We are working to include this data as soon as possible.","Unavailable",{"$f":"'Storm Data'!I48","v":0},{"$f":"'Storm Data'!B48","v":0},{"$f":"IF('Storm Data'!C48=\"More\",\"or More\",IF('Storm Data'!C48=\"Less\",\"or Less\",\"\"))","v":""}]
[{"$f":"'Storm Data'!A49","v":0},"This measure description is currently unavailable.  We are working to include this data as soon as possible.","Unavailable",{"$f":"'Storm Data'!I49","v":0},{"$f":"'Storm Data'!B49","v":0},{"$f":"IF('Storm Data'!C49=\"More\",\"or More\",IF('Storm Data'!C49=\"Less\",\"or Less\",\"\"))","v":""}]
[{"$f":"'Storm Data'!A50","v":0},"This measure description is currently unavailable.  We are working to include this data as soon as possible.","Unavailable",{"$f":"'Storm Data'!I50","v":0},{"$f":"'Storm Data'!B50","v":0},{"$f":"IF('Storm Data'!C50=\"More\",\"or More\",IF('Storm Data'!C50=\"Less\",\"or Less\",\"\"))","v":""}]
[{"$f":"'Storm Data'!A51","v":0},"This measure description is currently unavailable.  We are working to include this data as soon as possible.","Unavailable",{"$f":"'Storm Data'!I51","v":0},{"$f":"'Storm Data'!B51","v":0},{"$f":"IF('Storm Data'!C51=\"More\",\"or More\",IF('Storm Data'!C51=\"Less\",\"or Less\",\"\"))","v":""}]
[{"$f":"'Storm Data'!A52","v":0},"This measure description is currently unavailable.  We are working to include this data as soon as possible.","Unavailable",{"$f":"'Storm Data'!I52","v":0},{"$f":"'Storm Data'!B52","v":0},{"$f":"IF('Storm Data'!C52=\"More\",\"or More\",IF('Storm Data'!C52=\"Less\",\"or Less\",\"\"))","v":""}]
[{"$f":"'Storm Data'!A53","v":0},"This measure description is currently unavailable.  We are working to include this data as soon as possible.","Unavailable",{"$f":"'Storm Data'!I53","v":0},{"$f":"'Storm Data'!B53","v":0},{"$f":"IF('Storm Data'!C53=\"More\",\"or More\",IF('Storm Data'!C53=\"Less\",\"or Less\",\"\"))","v":""}]
[{"$f":"'Storm Data'!A54","v":0},"This measure description is currently unavailable.  We are working to include this data as soon as possible.","Unavailable",{"$f":"'Storm Data'!I54","v":0},{"$f":"'Storm Data'!B54","v":0},{"$f":"IF('Storm Data'!C54=\"More\",\"or More\",IF('Storm Data'!C54=\"Less\",\"or Less\",\"\"))","v":""}]
[{"$f":"'Storm Data'!A55","v":0},"This measure description is currently unavailable.  We are working to include this data as soon as possible.","Unavailable",{"$f":"'Storm Data'!I55","v":0},{"$f":"'Storm Data'!B55","v":0},{"$f":"IF('Storm Data'!C55=\"More\",\"or More\",IF('Storm Data'!C55=\"Less\",\"or Less\",\"\"))","v":""}]
[{"$f":"'Storm Data'!A56","v":0},"This measure description is currently unavailable.  We are working to include this data as soon as possible.","Unavailable",{"$f":"'Storm Data'!I56","v":0},{"$f":"'Storm Data'!B56","v":0},{"$f":"IF('Storm Data'!C56=\"More\",\"or More\",IF('Storm Data'!C56=\"Less\",\"or Less\",\"\"))","v":""}]
[{"$f":"'Storm Data'!A57","v":0},"This measure description is currently unavailable.  We are working to include this data as soon as possible.","Unavailable",{"$f":"'Storm Data'!I57","v":0},{"$f":"'Storm Data'!B57","v":0},{"$f":"IF('Storm Data'!C57=\"More\",\"or More\",IF('Storm Data'!C57=\"Less\",\"or Less\",\"\"))","v":""}]
[{"$f":"'Storm Data'!A58","v":0},"This measure description is currently unavailable.  We are working to include this data as soon as possible.","Unavailable",{"$f":"'Storm Data'!I58","v":0},{"$f":"'Storm Data'!B58","v":0},{"$f":"IF('Storm Data'!C58=\"More\",\"or More\",IF('Storm Data'!C58=\"Less\",\"or Less\",\"\"))","v":""}]
[{"$f":"'Storm Data'!A59","v":0},"This measure description is currently unavailable.  We are working to include this data as soon as possible.","Unavailable",{"$f":"'Storm Data'!I59","v":0},{"$f":"'Storm Data'!B59","v":0},{"$f":"IF('Storm Data'!C59=\"More\",\"or More\",IF('Storm Data'!C59=\"Less\",\"or Less\",\"\"))","v":""}]
[{"$f":"'Storm Data'!A60","v":0},"This measure description is currently unavailable.  We are working to include this data as soon as possible.","Unavailable",{"$f":"'Storm Data'!I60","v":0},{"$f":"'Storm Data'!B60","v":0},{"$f":"IF('Storm Data'!C60=\"More\",\"or More\",IF('Storm Data'!C60=\"Less\",\"or Less\",\"\"))","v":""}]
[{"$f":"'Fiber Data'!A41","v":"Revenue - Enterprise"},"This measure description is currently unavailable.  We are working to include this data as soon as possible.","Unavailable",{"$f":"'Fiber Data'!I41","v":371316.6},{"$f":"'Fiber Data'!B41","v":366635},{"$f":"IF('Fiber Data'!C41=\"More\",\"or More\",IF('Fiber Data'!C41=\"Less\",\"or Less\",\"\"))","v":"or More"}]
[{"$f":"'Fiber Data'!A42","v":"Revenue - City"},"This measure description is currently unavailable.  We are working to include this data as soon as possible.","Unavailable",{"$f":"'Fiber Data'!I42","v":535715.26},{"$f":"'Fiber Data'!B42","v":1275665},{"$f":"IF('Fiber Data'!C42=\"More\",\"or More\",IF('Fiber Data'!C42=\"Less\",\"or Less\",\"\"))","v":""}]
[{"$f":"'Fiber Data'!A43","v":"Net Increase/Decrease in Customer Count (Enterprise)"},"This measure description is currently unavailable.  We are working to include this data as soon as possible.","Unavailable",{"$f":"'Fiber Data'!I43","v":2},{"$f":"'Fiber Data'!B43","v":11},{"$f":"IF('Fiber Data'!C43=\"More\",\"or More\",IF('Fiber Data'!C43=\"Less\",\"or Less\",\"\"))","v":"or More"}]
[{"$f":"'Fiber Data'!A44","v":"Net Increase/Decrease in Contract Value (Enterprise)"},"This measure description is currently unavailable.  We are working to include this data as soon as possible.","Unavailable",{"$f":"'Fiber Data'!I44","v":56391},{"$f":"'Fiber Data'!B44","v":104733},{"$f":"IF('Fiber Data'!C44=\"More\",\"or More\",IF('Fiber Data'!C44=\"Less\",\"or Less\",\"\"))","v":"or More"}]
[{"$f":"'Fiber Data'!A45","v":"Enterprise:  Technical Issues Reported"},"This measure description is currently unavailable.  We are working to include this data as soon as possible.","Unavailable",{"$f":"'Fiber Data'!I45","v":5},{"$f":"'Fiber Data'!B45","v":12},{"$f":"IF('Fiber Data'!C45=\"More\",\"or More\",IF('Fiber Data'!C45=\"Less\",\"or Less\",\"\"))","v":"or Less"}]
[{"$f":"'Fiber Data'!A46","v":"Enterprise:  Phone Outages Reported"},"This measure description is currently unavailable.  We are working to include this data as soon as possible.","Unavailable",{"$f":"'Fiber Data'!I46","v":18},{"$f":"'Fiber Data'!B46","v":8},{"$f":"IF('Fiber Data'!C46=\"More\",\"or More\",IF('Fiber Data'!C46=\"Less\",\"or Less\",\"\"))","v":"or Less"}]
[{"$f":"'Fiber Data'!A47","v":"Enterprise:  Internet Outages Reported"},"This measure description is currently unavailable.  We are working to include this data as soon as possible.","Unavailable",{"$f":"'Fiber Data'!I47","v":2},{"$f":"'Fiber Data'!B47","v":7},{"$f":"IF('Fiber Data'!C47=\"More\",\"or More\",IF('Fiber Data'!C47=\"Less\",\"or Less\",\"\"))","v":"or Less"}]
[{"$f":"'Fiber Data'!A48","v":"Enterprise:  Billing Errors Reported"},"This measure description is currently unavailable.  We are working to include this data as soon as possible.","Unavailable",{"$f":"'Fiber Data'!I48","v":0},{"$f":"'Fiber Data'!B48","v":5},{"$f":"IF('Fiber Data'!C48=\"More\",\"or More\",IF('Fiber Data'!C48=\"Less\",\"or Less\",\"\"))","v":"or Less"}]
[{"$f":"'Fiber Data'!A49","v":"Service Change Request:  Add Service"},"This measure description is currently unavailable.  We are working to include this data as soon as possible.","Unavailable",{"$f":"'Fiber Data'!I49","v":11},{"$f":"'Fiber Data'!B49","v":18},{"$f":"IF('Fiber Data'!C49=\"More\",\"or More\",IF('Fiber Data'!C49=\"Less\",\"or Less\",\"\"))","v":"or More"}]
[{"$f":"'Fiber Data'!A50","v":"Service Change Request:  Remove Service"},"This measure description is currently unavailable.  We are working to include this data as soon as possible.","Unavailable",{"$f":"'Fiber Data'!I50","v":6},{"$f":"'Fiber Data'!B50","v":12},{"$f":"IF('Fiber Data'!C50=\"More\",\"or More\",IF('Fiber Data'!C50=\"Less\",\"or Less\",\"\"))","v":"or Less"}]
[{"$f":"'Fiber Data'!A51","v":"Service Change Request:  Move Service"},"This measure description is currently unavailable.  We are working to include this data as soon as possible.","Unavailable",{"$f":"'Fiber Data'!I51","v":1},{"$f":"'Fiber Data'!B51","v":12},{"$f":"IF('Fiber Data'!C51=\"More\",\"or More\",IF('Fiber Data'!C51=\"Less\",\"or Less\",\"\"))","v":"or Less"}]
[{"$f":"'Fiber Data'!A52","v":"Total Support Requests (Enterprise)"},"This measure description is currently unavailable.  We are working to include this data as soon as possible.","Unavailable",{"$f":"'Fiber Data'!I52","v":43},{"$f":"'Fiber Data'!B52","v":84},{"$f":"IF('Fiber Data'!C52=\"More\",\"or More\",IF('Fiber Data'!C52=\"Less\",\"or Less\",\"\"))","v":"or Less"}]
[{"$f":"'Fiber Data'!A53","v":"Total Support Requests (City)"},"This measure description is currently unavailable.  We are working to include this data as soon as possible.","Unavailable",{"$f":"'Fiber Data'!I53","v":1398},{"$f":"'Fiber Data'!B53","v":1351},{"$f":"IF('Fiber Data'!C53=\"More\",\"or More\",IF('Fiber Data'!C53=\"Less\",\"or Less\",\"\"))","v":"or Less"}]
[{"$f":"'Fiber Data'!A54","v":"Cell Minutes Consumed (City)"},"This measure description is currently unavailable.  We are working to include this data as soon as possible.","Unavailable",{"$f":"'Fiber Data'!I54","v":251304},{"$f":"'Fiber Data'!B54","v":331737},{"$f":"IF('Fiber Data'!C54=\"More\",\"or More\",IF('Fiber Data'!C54=\"Less\",\"or Less\",\"\"))","v":"or Less"}]
[{"$f":"'Fiber Data'!A55","v":0},"This measure description is currently unavailable.  We are working to include this data as soon as possible.","Unavailable",{"$f":"'Fiber Data'!I55","v":0},{"$f":"'Fiber Data'!B55","v":0},{"$f":"IF('Fiber Data'!C55=\"More\",\"or More\",IF('Fiber Data'!C55=\"Less\",\"or Less\",\"\"))","v":""}]
[{"$f":"'Fiber Data'!A56","v":0},"This measure description is currently unavailable.  We are working to include this data as soon as possible.","Unavailable",{"$f":"'Fiber Data'!I56","v":0},{"$f":"'Fiber Data'!B56","v":0},{"$f":"IF('Fiber Data'!C56=\"More\",\"or More\",IF('Fiber Data'!C56=\"Less\",\"or Less\",\"\"))","v":""}]
[{"$f":"'Fiber Data'!A57","v":0},"This measure description is currently unavailable.  We are working to include this data as soon as possible.","Unavailable",{"$f":"'Fiber Data'!I57","v":0},{"$f":"'Fiber Data'!B57","v":0},{"$f":"IF('Fiber Data'!C57=\"More\",\"or More\",IF('Fiber Data'!C57=\"Less\",\"or Less\",\"\"))","v":""}]
[{"$f":"'Fiber Data'!A58","v":0},"This measure description is currently unavailable.  We are working to include this data as soon as possible.","Unavailable",{"$f":"'Fiber Data'!I58","v":0},{"$f":"'Fiber Data'!B58","v":0},{"$f":"IF('Fiber Data'!C58=\"More\",\"or More\",IF('Fiber Data'!C58=\"Less\",\"or Less\",\"\"))","v":""}]
[{"$f":"'Fiber Data'!A59","v":0},"This measure description is currently unavailable.  We are working to include this data as soon as possible.","Unavailable",{"$f":"'Fiber Data'!I59","v":0},{"$f":"'Fiber Data'!B59","v":0},{"$f":"IF('Fiber Data'!C59=\"More\",\"or More\",IF('Fiber Data'!C59=\"Less\",\"or Less\",\"\"))","v":""}]
[{"$f":"'Fiber Data'!A60","v":0},"This measure description is currently unavailable.  We are working to include this data as soon as possible.","Unavailable",{"$f":"'Fiber Data'!I60","v":0},{"$f":"'Fiber Data'!B60","v":0},{"$f":"IF('Fiber Data'!C60=\"More\",\"or More\",IF('Fiber Data'!C60=\"Less\",\"or Less\",\"\"))","v":""}]

{"sheet":"Paper Intro","index":33,"n_rows":9,"n_cols":4,"rows_kept":9,"cut":false,"hidden":true,"merged":[[6,3,6,8],[8,3,8,8],[17,0,17,13]]}
["City of Cartersville"]
["Performance Dashboard"]
[{"$f":"CurrentMonth","v":"2012-01-01"}]
[]
["How to read the charts in the dashboard:"]
[]
["Sparklines",null,null,"This chart is used to show the trend of the performance measure over the previous 12 months.  No scale is displayed."]
[]
["Bullet Charts",null,null,"This chart is used to show progress towards a goal throughout the Fiscal Year.  There are three bands of gray.  Dark gray indicates a level that does not meet expectations, medium gray indicates a level that is near expectations, and light gray indicates a level that has met or exceeded expectations.  In some cases, this scale is reversed (when it is better to have less of something), and in some cases the optimal case is neither high nor low, but in the middle (i.e. you want to meet the target exactly).  The black horizontal line indicates the current status of the performance measure.  Typically, this represents the sum of the metric from the beginning of the fiscal year to present (i.e. Number of Potholes Filled).  In some cases, where it is more appropriate to use an average, the black line represents the average from the beginning of the fiscal year to present (i.e. Police Response Time - you wouldn't want to sum this!).  In cases where we have historical data available, the small verticle line indicates where we were at this point in the previous fiscal year."]